4-Cyclohexenyl radical
- Formula: C6H9
- Molecular weight: 81.1357
- IUPAC Standard InChIKey: DGYBQJBTUPEESA-UHFFFAOYSA-N
- CAS Registry Number: 15650-80-3
- Chemical structure:
View 3d structure (requires JavaScript / HTML 5) - Species with the same structure:

Gas phase ion energetics data

Data compiled by: Henry M. Rosenstock, Keith Draxl, Bruce W. Steiner, and John T. Herron
Ionization energy determinations
IE (eV) | Method | Reference |
---|---|---|
7.54 | EI | Pignataro, Cassuto, et al., 1967 |

References

Pignataro, Cassuto, et al., 1967
Pignataro, S.; Cassuto, A.; Lossing, F.P.,
Free radicals by mass spectrometry. XXXVI. Ionization potentials of conjugated and nonconjugated radicals,
J. Am. Chem. Soc., 1967, 89, 3693. [all data]