Phosphorus bromide difluoride
- Formula: BrF2P
- Molecular weight: 148.875
- IUPAC Standard InChIKey: QEKXBASJLGKOHM-UHFFFAOYSA-N
- CAS Registry Number: 15597-40-7
- Chemical structure:
View 3d structure (requires JavaScript / HTML 5) - Permanent link for this species. Use this link for bookmarking this species for future reference.

Gas phase ion energetics data

Data compiled by: Sharon G. Lias, Rhoda D. Levin, and Sherif A. Kafafi
Ionization energy determinations
IE (eV) | Method | Reference | Comment |
---|---|---|---|
11.1 ± 0.1 | PE | Cradock and Rankin, 1972 | Vertical value |

References

Cradock and Rankin, 1972
Cradock, S.; Rankin, D.W.H.,
Photoelectron spectra of PF2H some substituted difluorophosphines,
J. Chem. Soc. Faraday Trans. 2, 1972, 68, 940. [all data]