Manganese fluoride trioxide
- Formula: FMnO3
- Molecular weight: 121.9346
- CAS Registry Number: 15586-97-7

Gas phase ion energetics data

Data compiled by: Sharon G. Lias, Rhoda D. Levin, and Sherif A. Kafafi
Ionization energy determinations
IE (eV) | Method | Reference | Comment |
---|---|---|---|
12.20 ± 0.05 | PE | Diemann, Varetti, et al., 1977 | Vertical value |

Vibrational and/or electronic energy levels

Data compiled by: Takehiko Shimanouchi
Symmetry: C3ν Symmetry Number σ = 3
Sym. | No | Approximate | Selected Freq. | Infrared | Raman | Comments | ||||
---|---|---|---|---|---|---|---|---|---|---|
Species | type of mode | Value | Rating | Value | Phase | Value | Phase | |||
a1 | 1 | MnO3 s-str | 905 | B | 905.2 M | gas | ||||
a1 | 2 | MnF str | 721 | B | 720.7 M | gas | ||||
a1 | 3 | MnO3 s-deform | 338 | B | 337.7 W | gas | ||||
e | 4 | MnO3 d-str | 953 | B | 952.5 S | gas | ||||
e | 5 | MnO3 d-deform | 374 | B | 373.9 W | gas | ||||
e | 6 | MnF bend | 264 | B | 264.3 W | gas | ||||
Source: Shimanouchi, 1972

References

Diemann, Varetti, et al., 1977
Diemann, E.; Varetti, E.L.; Muller, A.,
The He(I) photoelectron spectra of the substituted permanganates MnO3F and MnO3Cl,
Chem. Phys. Lett., 1977, 51, 460. [all data]
Shimanouchi, 1972
Shimanouchi, T.,
Tables of Molecular Vibrational Frequencies Consolidated Volume II,
J. Phys. Chem. Ref. Data, 1972, 6, 3, 993-1102. [all data]