meta-Methoxybenzenethiol
- Formula: C7H8OS
- Molecular weight: 140.203
- IUPAC Standard InChIKey: QMVAZEHZOPDGHA-UHFFFAOYSA-N
- CAS Registry Number: 15570-12-4
- Chemical structure:
View 3d structure (requires JavaScript / HTML 5) - Other names: 3-Methoxythiophenol; m-Methoxythiophenol; m-Methoxy phenyl mercaptan; Benzenethiol, 3-methoxy-; 3-Methoxybenzenethiol

Phase change data

Data compiled by: Robert L. Brown and Stephen E. Stein
Quantity | Value | Units | Method | Reference | Comment |
---|---|---|---|---|---|
Tboil | 497.7 | K | N/A | Weast and Grasselli, 1989 |

Van Den Dool and Kratz RI, non-polar column, custom temperature program

Column type | Active phase | I | Reference | Comment |
---|---|---|---|---|
Capillary | VF-5MS | 1246.1 | Tret'yakov, 2008 | 30. m/0.25 mm/0.25 μm, He; Program: Multi-step temperature program; T(initial)=60C; T(final)=270C |

References

Weast and Grasselli, 1989
CRC Handbook of Data on Organic Compounds, 2nd Editon, Weast,R.C and Grasselli, J.G., ed(s)., CRC Press, Inc., Boca Raton, FL, 1989, 1. [all data]
Tret'yakov, 2008
Tret'yakov, K.V.,
Retention Data. NIST Mass Spectrometry Data Center., NIST Mass Spectrometry Data Center, 2008. [all data]