Mercapto-d1-benzene
- Formula: C6H5DS
- Molecular weight: 111.183
- IUPAC Standard InChIKey: RMVRSNDYEFQCLF-DYCDLGHISA-N
- CAS Registry Number: 15570-03-3
- Chemical structure:
View 3d structure (requires JavaScript / HTML 5) - Isotopologues:

Gas phase ion energetics data

Data compiled by: Henry M. Rosenstock, Keith Draxl, Bruce W. Steiner, and John T. Herron
Ionization energy determinations
IE (eV) | Method | Reference |
---|---|---|
8.5 ± 0.1 | EI | Earnshaw, Cook, et al., 1964 |
Appearance energy determinations
Ion | AE (eV) | Other Products | Method | Reference | Comment |
---|---|---|---|---|---|
CDS+ | 12.7 ± 0.2 | ? | EI | Earnshaw, Cook, et al., 1964 | |
CHS+ | 12.7 ± 0.2 | ? | EI | Earnshaw, Cook, et al., 1964 | |
C4H3DS+ | 11.8 | ? | EI | Earnshaw, Cook, et al., 1964 | |
C4H4S+ | 11.8 ± 0.2 | ? | EI | Earnshaw, Cook, et al., 1964 | |
C5H5D+ | 11.9 | ? | EI | Earnshaw, Cook, et al., 1964 | |
C6H5+ | 13.3 ± 0.2 | EI | EI | Earnshaw, Cook, et al., 1964 | |
C6H5S+ | 12.2 | D | EI | Earnshaw, Cook, et al., 1964 |

References

Earnshaw, Cook, et al., 1964
Earnshaw, D.G.; Cook, G.L.; Dinneen, G.U.,
A study of selected ions in the mass spectra of benzenethiol and deuterated benzenethiol,
J. Phys. Chem., 1964, 68, 296. [all data]