Tricyclo[4.2.1.02,5]nona-3,7-diene,(1α,2α,5α,6α)-
- Formula: C9H10
- Molecular weight: 118.1757
- IUPAC Standard InChIKey: KXHIYQZTTRKYGP-SPJNRGJMSA-N
- CAS Registry Number: 15564-45-1
- Chemical structure:
View 3d structure (requires JavaScript / HTML 5) - Stereoisomers:

Gas phase ion energetics data

Data compiled by: Sharon G. Lias, Rhoda D. Levin, and Sherif A. Kafafi
Ionization energy determinations
IE (eV) | Method | Reference | Comment |
---|---|---|---|
9.03 ± 0.03 | PE | Martin, Kagabu, et al., 1974 | Vertical value |

References

Martin, Kagabu, et al., 1974
Martin, H.-D.; Kagabu, S.; Schwesinger, R.,
Photoelektronenspektroskopische untersuchung der intramolekularen π,π-wechselwirkungen in endo-tricyclo[4.2.1.02,5]- nonadienen. Homokonjugation mit cyclobutanen,
Chem. Ber., 1974, 107, 3130. [all data]