Tricyclo[4.2.1.02,5]nona-3,7-diene,(1α,2β,5β,6α)-
- Formula: C9H10
- Molecular weight: 118.1757
- IUPAC Standard InChIKey: KXHIYQZTTRKYGP-OJOKCITNSA-N
- CAS Registry Number: 15564-44-0
- Chemical structure:
View 3d structure (requires JavaScript / HTML 5) - Stereoisomers:

Gas phase ion energetics data

Data compiled by: Sharon G. Lias, Rhoda D. Levin, and Sherif A. Kafafi
Ionization energy determinations
IE (eV) | Method | Reference | Comment |
---|---|---|---|
8.65 ± 0.05 | PE | Brogli, Eberbach, et al., 1973 | Vertical value |

References

Brogli, Eberbach, et al., 1973
Brogli, F.; Eberbach, W.; Haselbach, E.; Heilbronner, E.; Hornung, V.; Lemal, D.M.,
199. Die photoelecktronen-spektren des tricyclo[4.2.1.02,5]nonadiens und seines 3,4-diaza-analogons. Ein Beitrag zur kenntnis der wechselwirkung zwischen den einsamen elektronenpaaren der cis-konfigurierten azogrupp,
Helv. Chim. Acta, 1973, 56, 1933. [all data]