Cyclopentane, iodo-
- Formula: C5H9I
- Molecular weight: 196.0294
- IUPAC Standard InChIKey: PCEBAZIVZVIQEO-UHFFFAOYSA-N
- CAS Registry Number: 1556-18-9
- Chemical structure:
View 3d structure (requires JavaScript / HTML 5) - Other names: Cyclopentyl iodide; Iodocyclopentane

Gas phase ion energetics data

Data compiled as indicated in comments:
LLK - Sharon G. Lias, Rhoda D. Levin, and Sherif A. Kafafi
Ionization energy determinations
IE (eV) | Method | Reference | Comment |
---|---|---|---|
9.07 | PE | Boschi and Salahub, 1974 | LLK |
9.07 | PE | Boschi and Salahub, 1972 | LLK |
9.076 | S | Boschi and Salahub, 1972 | LLK |

References

Boschi and Salahub, 1974
Boschi, R.A.A.; Salahub, D.R.,
The high resolution photoelectron spectra of some iodoalkanes, iodocycloalkanes, iodoalkenes, and fluoroiodohydrocarbons,
Can. J. Chem., 1974, 52, 1217. [all data]
Boschi and Salahub, 1972
Boschi, R.A.; Salahub, D.R.,
The far ultra-violet spectra of some branched chain iodo-alkanes, iodo-cycloalkanes, fluoro-iodoalkanes and iodo-alkenes,
Mol. Phys., 1972, 24, 735. [all data]