Cyclopent-4-ene-1,2,3-trione
- Formula: C5H2O3
- Molecular weight: 110.0676
- IUPAC Standard InChIKey: GSGMKOPCDJFHEF-UHFFFAOYSA-N
- CAS Registry Number: 15548-56-8
- Chemical structure:
View 3d structure (requires JavaScript / HTML 5) - Permanent link for this species. Use this link for bookmarking this species for future reference.

Gas phase ion energetics data

Data compiled as indicated in comments:
LBLHLM - Sharon G. Lias, John E. Bartmess, Joel F. Liebman, John L. Holmes, Rhoda D. Levin, and W. Gary Mallard
Ionization energy determinations
IE (eV) | Method | Reference | Comment |
---|---|---|---|
9.3 | PE | Gleiter, Dobler, et al., 1982 | LBLHLM |
9.56 | PE | Gleiter, Dobler, et al., 1982 | Vertical value; LBLHLM |

References

Gleiter, Dobler, et al., 1982
Gleiter, R.; Dobler, W.; Eckert-Maksic, M.,
The electronic structure of o-tropoquinone, p-tropoquinone, and cyclopentene-1,2,3-trione - PE spectroscopic investigations,
Nouv. J. Chim., 1982, 6, 123. [all data]