Mercury chloro-trichloromethyl
- Formula: CCl4Hg
- Molecular weight: 354.41
- IUPAC Standard InChIKey: HLTAYNDZGCUOBC-UHFFFAOYSA-M
- CAS Registry Number: 15514-38-2
- Chemical structure:
View 3d structure (requires JavaScript / HTML 5) - Permanent link for this species. Use this link for bookmarking this species for future reference.

Gas phase ion energetics data

Data compiled by: Sharon G. Lias, Rhoda D. Levin, and Sherif A. Kafafi
Appearance energy determinations
Ion | AE (eV) | Other Products | Method | Reference | Comment |
---|---|---|---|---|---|
CCl2+ | >10.39 ± 0.06 | ? | EI | Ujszaszy, Tamas, et al., 1980 | |
CCl3+ | 10.1 ± 0.08 | ? | EI | Ujszaszy, Tamas, et al., 1980 |

References

Ujszaszy, Tamas, et al., 1980
Ujszaszy, K.; Tamas, J.; Kagramanov, N.D.; Maltsev, A.K.; Nefedov, O.M.,
Mass spectrometric study of reactive intermediates formed by vacuum pyrolysis of RHgCCl3 compounds,
J. Anal. Appl. Pyrolysis, 1980, 2, 231. [all data]