Thiophene, 2-propyl-
- Formula: C7H10S
- Molecular weight: 126.219
- IUPAC Standard InChIKey: BTXIJTYYMLCUHI-UHFFFAOYSA-N
- CAS Registry Number: 1551-27-5
- Chemical structure:
View 3d structure (requires JavaScript / HTML 5) - Other names: 2-Propylthiophene; 2-n-Propylthiophene; isopropylthiophene

Phase change data

Data compiled as indicated in comments:
BS - Robert L. Brown and Stephen E. Stein
AC - William E. Acree, Jr., James S. Chickos
Quantity | Value | Units | Method | Reference | Comment |
---|---|---|---|---|---|
Tboil | 431.2 | K | N/A | Weast and Grasselli, 1989 | BS |
Quantity | Value | Units | Method | Reference | Comment |
ΔvapH° | 43.7 ± 1.0 | kJ/mol | C | Ribeiro da Silva and Santos, 2007 | AC |
Enthalpy of vaporization
ΔvapH (kJ/mol) | Temperature (K) | Reference | Comment |
---|---|---|---|
46.0 | 273. | Edwards and Prausnitz, 1981 | Based on data from 243. to 303. K. See also Dykyj, Svoboda, et al., 1999.; AC |

Gas phase ion energetics data

Data compiled as indicated in comments:
RDSH - Henry M. Rosenstock, Keith Draxl, Bruce W. Steiner, and John T. Herron
Ionization energy determinations
IE (eV) | Method | Reference | Comment |
---|---|---|---|
8.6 ± 0.2 | EI | Khvostenko, 1962 | RDSH |
Appearance energy determinations
Ion | AE (eV) | Other Products | Method | Reference | Comment |
---|---|---|---|---|---|
C4H4S+ | 11.1 ± 0.2 | ? | EI | Khvostenko, 1962 | RDSH |
C5H5S+ | 11.4 ± 0.2 | C2H5 | EI | Khvostenko, 1962 | RDSH |

Kovats' RI, non-polar column, isothermal

View large format table.

Column type Active phase Temperature (C) I Reference Comment
CapillarySqualane120.960.Agr, Tesaric, et al., 1973
CapillarySqualane86.955.Agr, Tesaric, et al., 1973
CapillarySqualane120.960.Agrawal, Tesarík, et al., 1972N2, Celite 545; Column length: 50. m; Column diameter: 0.3 mm
CapillarySqualane86.955.Agrawal, Tesarík, et al., 1972N2, Celite 545; Column length: 50. m; Column diameter: 0.3 mm

Van Den Dool and Kratz RI, non-polar column, temperature ramp

View large format table.

Column type Active phase I Reference Comment
CapillaryBPX-5969.Bredie, Mottram, et al., 200250. m/0.32 mm/0.5 μm, 60. C @ 5. min, 4. K/min, 250. C @ 20. min
CapillaryCP Sil 8 CB961.Elmore and Mottram, 200060. m/0.25 mm/0.25 μm, 60. C @ 2. min, 15. K/min; Tend: 280. C
CapillaryOV-101951.Misharina, Golovnya, et al., 199350. m/0.32 mm/0.5 μm, He, 4. K/min; Tstart: 50. C; Tend: 200. C
CapillaryDB-1937.Zhang and Ho, 198960. m/0.25 mm/0.25 μm, He, 2. K/min, 220. C @ 10. min; Tstart: 40. C

Van Den Dool and Kratz RI, polar column, temperature ramp

View large format table.

Column type Active phase I Reference Comment
CapillaryCP-Wax 52CB1246.Mahadevan and Farmer, 200660. C @ 5. min, 4. K/min, 220. C @ 30. min; Column length: 50. m; Column diameter: 0.32 mm
CapillaryCP-WAX 57CB1238.Whitfield, Mottram, et al., 1988He, 60. C @ 5. min, 4. K/min, 200. C @ 10. min; Column length: 50. m; Column diameter: 0.32 mm
CapillaryCP-WAX 57CB1239.Whitfield, Mottram, et al., 1988He, 60. C @ 5. min, 4. K/min, 200. C @ 10. min; Column length: 50. m; Column diameter: 0.32 mm

Normal alkane RI, non-polar column, temperature ramp

View large format table.

Column type Active phase I Reference Comment
CapillaryPONA941.Yang, Wang, et al., 200450. m/0.20 mm/0.50 μm, N2, 2. K/min; Tstart: 35. C; Tend: 170. C
CapillaryPONA939.Yang, Yang, et al., 200350. m/0.20 mm/0.50 μm, Helium, 2. K/min; Tstart: 30. C; Tend: 170. C
CapillaryDB-5966.Macku and Shibamoto, 1991He, 40. C @ 5. min, 2. K/min; Column length: 60. m; Column diameter: 0.25 mm; Tend: 160. C
CapillaryCP-Sil 5937.Damste, van Dalen, et al., 198825. m/0.32 mm/0.45 μm, Helium, 0. C @ 5. min, 3. K/min; Tend: 300. C
CapillaryCP-Sil 5937.Damste, van Dalen, et al., 198825. m/0.32 mm/0.45 μm, Helium, 0. C @ 5. min, 3. K/min; Tend: 300. C
CapillaryCP Sil 5 CB937.Damste, Kock-van Dalen, et al., 198825. m/0.32 mm/0.45 μm, He, 3. K/min; Tstart: 50. C; Tend: 300. C
CapillaryCP Sil 5 CB937.Damste, Kock-van Dalen, et al., 198825. m/0.32 mm/0.45 μm, He, 3. K/min; Tstart: 50. C; Tend: 300. C

Normal alkane RI, non-polar column, custom temperature program

View large format table.

Column type Active phase I Reference Comment
CapillaryTR-5 MS976.Kurashov, Mitrukova, et al., 201415. m/0.25 mm/0.25 μm, Helium; Program: 35 0C (3 min) 2 0C/min -> 60 0C (3 min) 2 0C/min -> 80 0C (3 min) 4 0C/min -> 120 0C (3 min) 5 0C/min -> 150 0C (3 min) 15 0C/min -> 240 0C (10 min)
CapillarySE-30951.Vinogradov, 2004Program: not specified
CapillaryMethyl Silicone951.Misharina, 1995Program: not specified

Normal alkane RI, polar column, custom temperature program

View large format table.

Column type Active phase I Reference Comment
CapillaryCarbowax 20M1259.Vinogradov, 2004Program: not specified

References

Weast and Grasselli, 1989
CRC Handbook of Data on Organic Compounds, 2nd Editon, Weast,R.C and Grasselli, J.G., ed(s)., CRC Press, Inc., Boca Raton, FL, 1989, 1. [all data]
Ribeiro da Silva and Santos, 2007
Ribeiro da Silva, M.A.V.; Santos, Ana Filipa L.O.M.,
Thermochemical study of 2- and 3-alkyl substituted thiophenes,
J Therm Anal Calorim, 2007, 88, 1, 7-17, https://doi.org/10.1007/s10973-006-8326-3
. [all data]
Edwards and Prausnitz, 1981
Edwards, D.R.; Prausnitz, J.M.,
Vapor pressures of some sulfur-containing, coal-related compounds,
J. Chem. Eng. Data, 1981, 26, 2, 121-124, https://doi.org/10.1021/je00024a005
. [all data]
Dykyj, Svoboda, et al., 1999
Dykyj, J.; Svoboda, J.; Wilhoit, R.C.; Frenkel, M.L.; Hall, K.R.,
Vapor Pressure of Chemicals: Part A. Vapor Pressure and Antoine Constants for Hydrocarbons and Sulfur, Selenium, Tellurium and Hydrogen Containing Organic Compounds, Springer, Berlin, 1999, 373. [all data]
Khvostenko, 1962
Khvostenko, V.I.,
Ionisation of thiophen and some of its derivatives by electron impact,
Zh. Fiz. Khim., 1962, 36, 384, In original 197. [all data]