Urea, N-(2-chlorophenyl)-N'-methyl-
- Formula: C8H9ClN2O
- Molecular weight: 184.623
- IUPAC Standard InChIKey: NFUCGJBURDOBPQ-UHFFFAOYSA-N
- CAS Registry Number: 15500-96-6
- Chemical structure:
View 3d structure (requires JavaScript / HTML 5) - Other names: Urea, 1-(o-chlorophenyl)-3-methyl-; N-Methyl-N1-(2-chlorophenyl)urea; 1-(2-Chlorophenyl)-3-methylurea; 1-Methyl-3-(2-chlorophenyl)urea

Gas phase ion energetics data

Data compiled by: Sharon G. Lias, Rhoda D. Levin, and Sherif A. Kafafi
Ionization energy determinations
IE (eV) | Method | Reference |
---|---|---|
8.35 ± 0.05 | EI | Baldwin, Loudon, et al., 1976 |
Appearance energy determinations
Ion | AE (eV) | Other Products | Method | Reference | Comment |
---|---|---|---|---|---|
C6H6NCl+ | 10.20 | ? | EI | Baldwin, Loudon, et al., 1976 | |
C8H9N2O+ | 9.35 | Cl | EI | Baldwin, Loudon, et al., 1976 |

References

Baldwin, Loudon, et al., 1976
Baldwin, M.A.; Loudon, A.G.; Maccoll, A.; Webb, K.S.,
The nature and fragmentation pathways of the molecular ions of some arylureas, arylthioureas, acetanilides, thioacetanilides and related compounds,
Org. Mass Spectrom., 1976, 11, 1181. [all data]