dysprosium triiodide
- Formula: DyI3
- Molecular weight: 543.213
- CAS Registry Number: 15474-63-2

Phase change data

Data compiled by: William E. Acree, Jr., James S. Chickos
Quantity | Value | Units | Method | Reference | Comment |
---|---|---|---|---|---|
ΔsubH° | 282. ± 4.0 | kJ/mol | TE | Brunetti, Vassallo, et al., 1999 | Based on data from 889. to 1157. K. |

Reaction thermochemistry data

Data compiled by: John E. Bartmess
Individual Reactions
By formula: I- + DyI3 = (I- • DyI3)
Quantity | Value | Units | Method | Reference | Comment |
---|---|---|---|---|---|
ΔrH° | 279. ± 8.4 | kJ/mol | TDAs | Lelik, Korobov, et al., 1984 | gas phase; anion heat reworked from reference due to better dHf(DyI3); value altered from reference due to conversion from electron convention to ion convention |
By formula: DyI4- + DyI3 = Dy2I7-
Quantity | Value | Units | Method | Reference | Comment |
---|---|---|---|---|---|
ΔrH° | 189.1 ± 2.5 | kJ/mol | TDAs | Lelik, Korobov, et al., 1984 | gas phase; reworked from reference due to better dHf(DyI3); value altered from reference due to conversion from electron convention to ion convention |

Gas phase ion energetics data

Data compiled by: Sharon G. Lias, Rhoda D. Levin, and Sherif A. Kafafi
Ionization energy determinations
IE (eV) | Method | Reference |
---|---|---|
9.6 ± 0.2 | EI | Hirayama and Castle, 1973 |
Appearance energy determinations
Ion | AE (eV) | Other Products | Method | Reference | Comment |
---|---|---|---|---|---|
Dy+ | 16.4 ± 0.2 | 3I | EI | Hirayama and Castle, 1973 | |
IDy+ | 13.1 ± 0.2 | 2I | EI | Hirayama and Castle, 1973 | |
I2Dy+ | 10.5 ± 0.2 | I | EI | Hirayama and Castle, 1973 |

Ion clustering data

Data compiled by: John E. Bartmess

Clustering reactions

DyI4- + DyI3 = Dy2I7-

By formula: DyI4- + DyI3 = Dy2I7-

Quantity Value Units Method Reference Comment
Δr189.1 ± 2.5kJ/molTDAsLelik, Korobov, et al., 1984gas phase; reworked from reference due to better dHf(DyI3); value altered from reference due to conversion from electron convention to ion convention

Iodide + DyI3 = (Iodide • DyI3)

By formula: I- + DyI3 = (I- • DyI3)

Quantity Value Units Method Reference Comment
Δr279. ± 8.4kJ/molTDAsLelik, Korobov, et al., 1984gas phase; anion heat reworked from reference due to better dHf(DyI3); value altered from reference due to conversion from electron convention to ion convention

References

Brunetti, Vassallo, et al., 1999
Brunetti, Bruno; Vassallo, Papirio; Piacente, Vincenzo; Scardala, Paolo,
Vaporization Studies of Dysprosium Trichloride, Tribromide, and Triiodide,
J. Chem. Eng. Data, 1999, 44, 3, 509-515, https://doi.org/10.1021/je9801821
. [all data]
Lelik, Korobov, et al., 1984
Lelik, L.; Korobov, M.V.; Kaposi, O.; Sidorov, L.N.,
Negative Ions in the Gas Phase of Dysprosium Triiodide and of the CsI-DyI3 and CsI-NaI-DyI3 Systems,
Russ. J. Phys. Chem., 1984, 58, 1164. [all data]
Hirayama and Castle, 1973
Hirayama, C.; Castle, P.M.,
Mass spectra of rare earth triiodides,
J. Phys. Chem., 1973, 77, 3110. [all data]