N-Trifluoroacetylimidazole
- Formula: C5H3F3N2O
- Molecular weight: 164.0853
- IUPAC Standard InChIKey: SINBGNJPYWNUQI-UHFFFAOYSA-N
- CAS Registry Number: 1546-79-8
- Chemical structure:
View 3d structure (requires JavaScript / HTML 5) - Other names: 1-(Trifluoroacetyl)imidazole; 1H-Imidazole, 1-(trifluoroacetyl)-; Imidazole, N-trifluoroacetyl; 1-(trifluoroacetyl)-1H-imidazole

Phase change data

Data compiled by: Robert L. Brown and Stephen E. Stein
Reduced pressure boiling point
Tboil (K) | Pressure (bar) | Reference |
---|---|---|
335. | 0.051 | PCR Inc., 1990 |

Gas phase ion energetics data

Data compiled by: Sharon G. Lias, Rhoda D. Levin, and Sherif A. Kafafi
Ionization energy determinations
IE (eV) | Method | Reference | Comment |
---|---|---|---|
9.91 | PE | Ramsey, 1979 | Vertical value |

Normal alkane RI, non-polar column, custom temperature program

Column type | Active phase | I | Reference | Comment |
---|---|---|---|---|
Capillary | Polydimethyl siloxanes | 830. | Zenkevich, 2001 | Program: not specified |

References

PCR Inc., 1990
PCR Inc.,
Research Chemicals Catalog 1990-1991, PCR Inc., Gainesville, FL, 1990, 1. [all data]
Ramsey, 1979
Ramsey, B.G.,
Substituent effects on imidazole basicity and photoelectron spectroscopy determined ionization energies,
J. Org. Chem., 1979, 44, 2093. [all data]
Zenkevich, 2001
Zenkevich, I.G.,
Encyclopedia of Chromatography. Derivatization of Amines, Amino Acids, Amides and Imides for GC Analysis, Marcel Dekker, Inc, New York - Basel, 2001, 224. [all data]