(E)-C2H5N=NC2H5
- Formula: C4H10N2
- Molecular weight: 86.1356
- IUPAC Standard InChIKey: INTMMHZKGCDQGT-UHFFFAOYSA-N
- CAS Registry Number: 15463-99-7
- Chemical structure:
View 3d structure (requires JavaScript / HTML 5) - Species with the same structure:
- Other names: (E)-Azoethane

Gas phase ion energetics data

Data compiled by: Sharon G. Lias, Rhoda D. Levin, and Sherif A. Kafafi
Ionization energy determinations
IE (eV) | Method | Reference | Comment |
---|---|---|---|
8.77 | PE | Houk, Chang, et al., 1975 | Vertical value |

Kovats' RI, non-polar column, isothermal

Column type | Active phase | Temperature (C) | I | Reference | Comment |
---|---|---|---|---|---|
Capillary | Methyl Silicone | 50. | 571.9 | Görgényi, Fekete, et al., 1989 | 50. m/0.32 mm/1. μm, N2 |

Normal alkane RI, non-polar column, custom temperature program

Column type | Active phase | I | Reference | Comment |
---|---|---|---|---|
Capillary | Methyl Silicone | 564. | Zenkevich, 1999 | Program: not specified |

References

Houk, Chang, et al., 1975
Houk, K.N.; Chang, Y.-M.; Engel, P.S.,
Photoelectron spectroscopy of azo compounds,
J. Am. Chem. Soc., 1975, 97, 1824. [all data]
Görgényi, Fekete, et al., 1989
Görgényi, M.; Fekete, Z.; Seres, L.,
Estimation and prediction of the retention indices of selected trans-diazenes,
Chromatographia, 1989, 27, 11/12, 581-584, https://doi.org/10.1007/BF02258982
. [all data]
Zenkevich, 1999
Zenkevich, I.G.,
Precalculation of Gas Chromatographic Retention Indices of Organic Compounds from Boiling Points of their Structural Analogues,
Zh. Struct. Khim., 1999, 40, 1, 121-130. [all data]