Arsine, silyl-
- Formula: AsH5Si
- Molecular weight: 108.0468
- IUPAC Standard InChIKey: QNXQPPKJWUDNQJ-UHFFFAOYSA-N
- CAS Registry Number: 15455-99-9
- Chemical structure:
View 3d structure (requires JavaScript / HTML 5) - Other names: Silane, arsino-

Gas phase ion energetics data

Data compiled by: Henry M. Rosenstock, Keith Draxl, Bruce W. Steiner, and John T. Herron
Ionization energy determinations
IE (eV) | Method | Reference |
---|---|---|
10.1 ± 0.1 | EI | Saalfeld and McDowell, 1967 |
Appearance energy determinations
Ion | AE (eV) | Other Products | Method | Reference | Comment |
---|---|---|---|---|---|
AsSiH+ | 13.4 ± 0.1 | 2H2 | EI | Saalfeld and McDowell, 1967 | |
AsH2+ | 12.4 ± 0.2 | ? | EI | Saalfeld and McDowell, 1967 | |
AsSiH2+ | 13.7 ± 0.2 | H2+H | EI | Saalfeld and McDowell, 1967 | |
AsH3+ | 13.1 ± 0.6 | ? | EI | Saalfeld and McDowell, 1967 | |
AsSiH3+ | 9.7 ± 0.1 | H2 | EI | Saalfeld and McDowell, 1967 | |
AsSiH4+ | 11.0 ± 0.3 | H | EI | Saalfeld and McDowell, 1967 | |
AsSi+ | 16.8 ± 0.3 | 2H2+H | EI | Saalfeld and McDowell, 1967 |

References

Saalfeld and McDowell, 1967
Saalfeld, F.E.; McDowell, M.V.,
The mass spectra of volatile hydrides. V. Silylarsine,
Inorg. Chem., 1967, 6, 96. [all data]