Piperidine, 1-pentafluorophenyl-
- Formula: C11H10F5N
- Molecular weight: 251.1958
- IUPAC Standard InChIKey: OXZRZCYNYRTPFT-UHFFFAOYSA-N
- CAS Registry Number: 15445-66-6
- Chemical structure:
View 3d structure (requires JavaScript / HTML 5) - Permanent link for this species. Use this link for bookmarking this species for future reference.

Gas phase ion energetics data

Data compiled by: Sharon G. Lias, John E. Bartmess, Joel F. Liebman, John L. Holmes, Rhoda D. Levin, and W. Gary Mallard
Ionization energy determinations
IE (eV) | Method | Reference | Comment |
---|---|---|---|
8.46 | PE | Furin, Sultanov, et al., 1987 | Vertical value |

References

Furin, Sultanov, et al., 1987
Furin, G.G.; Sultanov, A.S.; Furlei, I.I.,
Photoelectronic spectra of fluorine-containing aromatic amines,
Dokl. Phys. Chem., 1987, 530. [all data]