Tungsten, pentacarbonyl(triphenylphosphine)-, (OC-6-22)-
- Formula: C23H15O5PW
- Molecular weight: 586.18
- IUPAC Standard InChIKey: LCHJMKIEZQLWKI-UHFFFAOYSA-N
- CAS Registry Number: 15444-65-2
- Chemical structure:

Condensed phase thermochemistry data

Data compiled by: José A. Martinho Simões
Quantity | Value | Units | Method | Reference | Comment |
---|---|---|---|---|---|
ΔfH°solid | -718.6 ± 5.8 | kJ/mol | Review | Martinho Simões |

Phase change data

Data compiled by: José A. Martinho Simões
Quantity | Value | Units | Method | Reference | Comment |
---|---|---|---|---|---|
ΔsubH° | 143.8 ± 2.5 | kJ/mol | TD-HFC | Al-Takhin, Connor, et al., 1984 |

Gas phase ion energetics data

Data compiled by: Sharon G. Lias, Rhoda D. Levin, and Sherif A. Kafafi
Ionization energy determinations
IE (eV) | Method | Reference | Comment |
---|---|---|---|
7.80 ± 0.05 | EI | Paetzold and Abd-el-Mottaleb, 1975 | |
7.36 | PE | Daamen, Oskam, et al., 1980 | Vertical value |
Appearance energy determinations
Ion | AE (eV) | Other Products | Method | Reference | Comment |
---|---|---|---|---|---|
C20H15O2PW+ | 9.5 | 3CO | EI | Torroni, Innorta, et al., 1974 | |
C21H15O3PW+ | 9.1 | 2CO | EI | Torroni, Innorta, et al., 1974 | |
C22H15O4PW+ | 8.5 | CO | EI | Torroni, Innorta, et al., 1974 |

Gas phase thermochemistry data

Data compiled by: José A. Martinho Simões
Quantity | Value | Units | Method | Reference | Comment |
---|---|---|---|---|---|
ΔfH°gas | -574.8 ± 6.3 | kJ/mol | Review | Martinho Simões |

References

Martinho Simões
Martinho Simões, J.A.,
Private communication (see http://webbook.nist.gov/chemistry/om/). [all data]
Al-Takhin, Connor, et al., 1984
Al-Takhin, G.; Connor, J.A.; Pilcher, G.; Skinner, H.A.,
J. Organomet. Chem., 1984, 265, 263. [all data]
Paetzold and Abd-el-Mottaleb, 1975
Paetzold, R.; Abd-el-Mottaleb, S.,
Correlative studies of some spectroscopic and bonding parameters in octahedrally coordinated metal carbonyl complexes,
J. Mol. Struct., 1975, 24, 357. [all data]
Daamen, Oskam, et al., 1980
Daamen, H.; Oskam, A.; Stufkens, D.J.,
U.V. photoelectron (He I and He II) studies of M(CO)5PR3 (M = Cr, W and R = C6H11, C6H5, O-i-C3H7, OC6H5) and W(CO)5As(C6H5)3,
Inorg. Chim. Acta, 1980, 38, 71. [all data]
Torroni, Innorta, et al., 1974
Torroni, S.; Innorta, G.; Foffani, A.; Distefano, G.,
Interpretation of the mass spectra of substituted chromium and tungsten carbonyls by means of appearance potential measurements,
J. Organomet. Chem., 1974, 65, 209. [all data]