Benzene, 1-(1,1-dimethylethoxy)-4-methyl-
- Formula: C11H16O
- Molecular weight: 164.2441
- IUPAC Standard InChIKey: FETIWDPIODONQB-UHFFFAOYSA-N
- CAS Registry Number: 15359-98-5
- Chemical structure:
View 3d structure (requires JavaScript / HTML 5) - Other names: Ether, tert-butyl p-tolyl; p-tert-Butoxytoluene; tert-Butyl p-tolyl ether; tert-Butyl-4-tolyl ether

Gas phase ion energetics data

Data compiled by: Sharon G. Lias, Rhoda D. Levin, and Sherif A. Kafafi
Ionization energy determinations
IE (eV) | Method | Reference | Comment |
---|---|---|---|
8.23 | PE | Dewar, Ernstbrunner, et al., 1974 | Vertical value |

References

Dewar, Ernstbrunner, et al., 1974
Dewar, P.S.; Ernstbrunner, E.; Gilmore, J.R.; Godfrey, M.; Mellor, J.M.,
Conformational analysis of alkyl aryl ethers and alkyl aryl sulphides by photoelectron spectroscopy,
Tetrahedron, 1974, 30, 2455. [all data]