Benzene, 1-(1,1-dimethylethoxy)-2-methyl-
- Formula: C11H16O
- Molecular weight: 164.2441
- IUPAC Standard InChIKey: LSDMDIYCJNRNBA-UHFFFAOYSA-N
- CAS Registry Number: 15359-96-3
- Chemical structure:
View 3d structure (requires JavaScript / HTML 5) - Other names: Ether, tert-butyl o-tolyl

Gas phase ion energetics data

Data compiled by: Sharon G. Lias, Rhoda D. Levin, and Sherif A. Kafafi
Ionization energy determinations
IE (eV) | Method | Reference | Comment |
---|---|---|---|
8.45 | PE | Friege and Klessinger, 1979 | Vertical value |

References

Friege and Klessinger, 1979
Friege, H.; Klessinger, M.,
Elektronenstruktur von Alkyl-aryl- und Alkyl-vinyl-ethern,
Chem. Ber., 1979, 112, 1614. [all data]