Dimethyl amidogen

Gas phase ion energetics data

Data compiled as indicated in comments:
LL - Sharon G. Lias and Joel F. Liebman
RDSH - Henry M. Rosenstock, Keith Draxl, Bruce W. Steiner, and John T. Herron
B - John E. Bartmess

Quantity Value Units Method Reference Comment
Δf(+) ion644.kJ/molN/AN/A

Electron affinity determinations

EA (eV) Method Reference Comment
0.432 ± 0.015LPESRadisic, Xu, et al., 2002BDE supported by 72GOL/SOL, over McMillen and Golden, 1982; B
0.376 ± 0.095D-EAMacKay, Hemsworth, et al., 1976B
1.04074SIPage and Goode, 1969The Magnetron method, lacking mass analysis, is not considered reliable.; B

Ionization energy determinations

IE (eV) Method Reference Comment
5.17DERLias, Bartmess, et al., 1988LL

Appearance energy determinations

Ion AE (eV) Other Products MethodReferenceComment
C2H6N+9.4 ± 0.1?EIFisher and Henderson, 1967RDSH

References

Radisic, Xu, et al., 2002
Radisic, D.; Xu, S.J.; Bowen, K.H., Photoelectron spectroscopy of the anions, CH3NH- and (CH3)(2)N- and the anion complexes, H-(CH3NH2) and (CH3)(2)N-[(CH3)(2)NH), Chem. Phys. Lett., 2002, 354, 1-2, 9-13, https://doi.org/10.1016/S0009-2614(01)01470-1 . [all data]

McMillen and Golden, 1982
McMillen, D.F.; Golden, D.M., Hydrocarbon bond dissociation energies, Ann. Rev. Phys. Chem., 1982, 33, 493. [all data]

MacKay, Hemsworth, et al., 1976
MacKay, G.J.; Hemsworth, R.S.; Bohme, D.K., Absolute gas-phase acidities of CH3NH2, C2H5NH2, (CH3)2NH, and (CH3)3N, Can. J. Chem., 1976, 54, 1624. [all data]

Page and Goode, 1969
Page, F.M.; Goode, G.C., Negative Ions and the Magnetron., Wiley, NY, 1969. [all data]

Lias, Bartmess, et al., 1988
Lias, S.G.; Bartmess, J.E.; Liebman, J.F.; Holmes, J.L.; Levin, R.D.; Mallard, W.G., Gas-phase ion and neutral thermochemistry, J. Phys. Chem. Ref. Data, Suppl. 1, 1988, 17, 1-861. [all data]

Fisher and Henderson, 1967
Fisher, I.P.; Henderson, E., Mass spectrometry of free radicals, J. Chem. Soc. Faraday Trans., 1967, 63, 1342. [all data]