Isoquinoline, 2-oxide
- Formula: C9H7NO
- Molecular weight: 145.1580
- IUPAC Standard InChIKey: RZIAABRFQASVSW-UHFFFAOYSA-N
- CAS Registry Number: 1532-72-5
- Chemical structure:
View 3d structure (requires JavaScript / HTML 5) - Other names: Isoquinoline oxide; Isoquinoline N-oxide; isoquinolin-N-oxide

Gas phase ion energetics data

Data compiled as indicated in comments:
LLK - Sharon G. Lias, Rhoda D. Levin, and Sherif A. Kafafi
Ionization energy determinations
IE (eV) | Method | Reference | Comment |
---|---|---|---|
7.9 | PE | Maier, Muller, et al., 1975 | LLK |
7.98 ± 0.05 | PE | Maier, Muller, et al., 1975 | Vertical value; LLK |

References

Maier, Muller, et al., 1975
Maier, J.P.; Muller, J.-F.; Kubota, T.; Yamakawa, M.,
183. Ionisation energies and the electronic structures of the N-oxides of azanaphthalenes and azaanthracenes,
Helv. Chim. Acta, 1975, 58, 1641. [all data]