tri-μ-carbonylhexacarbonyldiiron
- Formula: C9Fe2O9
- Molecular weight: 363.781
- IUPAC Standard InChIKey: JCXLZXJCZPKTBW-UHFFFAOYSA-N
- CAS Registry Number: 15321-51-4
- Chemical structure:
View 3d structure (requires JavaScript / HTML 5) - Other names: Iron, tri-μ-carbonylhexacarbonyldi-, (fe-fe)

Phase change data

Data compiled by: William E. Acree, Jr., James S. Chickos
Quantity | Value | Units | Method | Reference | Comment |
---|---|---|---|---|---|
ΔsubH° | 75. ± 21. | kJ/mol | N/A | Pilcher and Skinner, 1983 | See also Connor, Skinner, et al., 1972. |
Enthalpy of sublimation
ΔsubH (kJ/mol) | Temperature (K) | Method | Reference | Comment |
---|---|---|---|---|
135.3 | 305. | A | Stephenson and Malanowski, 1987 | Based on data from 296. to 314. K. |

Gas phase ion energetics data

Data compiled as indicated in comments:
RDSH - Henry M. Rosenstock, Keith Draxl, Bruce W. Steiner, and John T. Herron
B - John E. Bartmess
Electron affinity determinations
EA (eV) | Method | Reference | Comment |
---|---|---|---|
2.73 ± 0.10 | LPES | Nakajima, Taguwa, et al., 1994 | Vertical Detachment Energy: 3.32±0.10 eV; B |
Ionization energy determinations
IE (eV) | Method | Reference | Comment |
---|---|---|---|
7.91 ± 0.01 | EI | Junk, Preston, et al., 1970 | RDSH |

References

Pilcher and Skinner, 1983
Pilcher, G.; Skinner, H.A.,
Thermochemistry of organometallic compounds, 1983, 43-90, https://doi.org/10.1002/9780470771686.ch2
. [all data]
Connor, Skinner, et al., 1972
Connor, J.A.; Skinner, H.A.; Virmani, Y.,
Microcalorimetric studies. Thermal decomposition and iodination of metal carbonyls,
J. Chem. Soc., Faraday Trans. 1, 1972, 68, 0, 1754, https://doi.org/10.1039/f19726801754
. [all data]
Stephenson and Malanowski, 1987
Stephenson, Richard M.; Malanowski, Stanislaw,
Handbook of the Thermodynamics of Organic Compounds, 1987, https://doi.org/10.1007/978-94-009-3173-2
. [all data]
Nakajima, Taguwa, et al., 1994
Nakajima, A.; Taguwa, T.; Kaya, K.,
Photoelectron Spectroscopy of Iron Carbonyl Cluster Anions (Fen(CO)m(-), n=1-4),
Chem. Phys. Lett., 1994, 221, 5-6, 436, https://doi.org/10.1016/0009-2614(94)00301-7
. [all data]
Junk, Preston, et al., 1970
Junk, G.A.; Preston, F.J.; Svec, H.J.; Thompson, D.T.,
Ligand effects on the ionization potentials and bond energies of some L1L2Fe2(CO)6 complexes,
J. Chem. Soc. A, 1970, 3171. [all data]