dibenzo[b,e]thiepin-11(6H)-one
- Formula: C14H10OS
- Molecular weight: 226.294
- IUPAC Standard InChIKey: JGJDEWXZEIHBNW-UHFFFAOYSA-N
- CAS Registry Number: 1531-77-7
- Chemical structure:
View 3d structure (requires JavaScript / HTML 5) - Permanent link for this species. Use this link for bookmarking this species for future reference.

Gas phase ion energetics data

Data compiled by: Sharon G. Lias, Rhoda D. Levin, and Sherif A. Kafafi
Ionization energy determinations
IE (eV) | Method | Reference |
---|---|---|
9.21 | EI | Sahini, Constantin, et al., 1978 |
Appearance energy determinations
Ion | AE (eV) | Other Products | Method | Reference | Comment |
---|---|---|---|---|---|
C13H10S+ | 9.75 | CO | EI | Sahini, Constantin, et al., 1978 | |
C14H9OS+ | 10.4 | H | EI | Sahini, Constantin, et al., 1978 | |
C14H10O+ | 9.45 | S | EI | Sahini, Constantin, et al., 1978 |

References

Sahini, Constantin, et al., 1978
Sahini, V.E.; Constantin, V.; Serban, I.; Vladescu, C.,
Electron impact-induced fragmentation of dibenzo[b,e]oxepin-11-one and dibenzo/b,e/thiepin-11-one,
Rev. Roum. Chim., 1978, 23, 163. [all data]