chlorotrimethylgermane
- Formula: C3H9ClGe
- Molecular weight: 153.20
- CAS Registry Number: 1529-47-1

Gas phase thermochemistry data

Data compiled by: José A. Martinho Simões
Quantity | Value | Units | Method | Reference | Comment |
---|---|---|---|---|---|
ΔfH°gas | -266.4 | kJ/mol | Review | Martinho Simões | The enthalpy of formation relies on -569. ± 17. kJ/mol for the estimated enthalpy of formation of [Ge(Me)3]2O(l) Baldwin, Lappert, et al., 1972. |

Reaction thermochemistry data

Data compiled by: John E. Bartmess
Individual Reactions
+ C3H9ClGe = C3H9Cl2Ge-
By formula: Cl- + C3H9ClGe = C3H9Cl2Ge-
Quantity | Value | Units | Method | Reference | Comment |
---|---|---|---|---|---|
ΔrH° | 92.9 ± 5.9 | kJ/mol | CIDT | Hao, Kaspar, et al., 2005 | gas phase |

Gas phase ion energetics data

Data compiled by: Sharon G. Lias, Rhoda D. Levin, and Sherif A. Kafafi
Ionization energy determinations
IE (eV) | Method | Reference | Comment |
---|---|---|---|
~10.1 | PE | Drake, Glavincevski, et al., 1979 | |
9.62 ± 0.04 | EI | Tamas, Czira, et al., 1972 | |
~10.5 | PE | Drake, Glavincevski, et al., 1979 | Vertical value |
10.35 | PE | Flamini, Semprini, et al., 1976 | Vertical value |
Appearance energy determinations
Ion | AE (eV) | Other Products | Method | Reference | Comment |
---|---|---|---|---|---|
C2H6ClGe+ | 10.44 ± 0.04 | CH3 | EI | Tamas, Czira, et al., 1972 | |
C3H9Ge+ | 11.75 ± 0.04 | Cl | EI | Tamas, Czira, et al., 1972 |

Ion clustering data

Data compiled by: John E. Bartmess
Clustering reactions
+ C3H9ClGe = C3H9Cl2Ge-
By formula: Cl- + C3H9ClGe = C3H9Cl2Ge-
Quantity | Value | Units | Method | Reference | Comment |
---|---|---|---|---|---|
ΔrH° | 92.9 ± 5.9 | kJ/mol | CIDT | Hao, Kaspar, et al., 2005 | gas phase |

Phase change data

Data compiled as indicated in comments:
MS - José A. Martinho Simões
AC - William E. Acree, Jr., James S. Chickos
Quantity | Value | Units | Method | Reference | Comment |
---|---|---|---|---|---|
ΔvapH° | 33.5 | kJ/mol | RSC | Baldwin, Lappert, et al., 1972 | MS |
Enthalpy of vaporization
ΔvapH (kJ/mol) | Temperature (K) | Method | Reference | Comment |
---|---|---|---|---|
36.3 | 308. | N/A | Ditsent, Skorokhodov, et al., 1972 | Based on data from 293. to 363. K.; AC |
34.4 | 307. | SG | Griffiths and Onyszchuk, 1961 | Based on data from 273. to 341. K.; AC |

Condensed phase thermochemistry data

Data compiled by: José A. Martinho Simões
Quantity | Value | Units | Method | Reference | Comment |
---|---|---|---|---|---|
ΔfH°liquid | -299.9 ± 8.4 | kJ/mol | Review | Martinho Simões | The enthalpy of formation relies on -569. ± 17. kJ/mol for the estimated enthalpy of formation of [Ge(Me)3]2O(l) Baldwin, Lappert, et al., 1972. |

References

Martinho Simões
Martinho Simões, J.A.,
Private communication (see http://webbook.nist.gov/chemistry/om/). [all data]
Baldwin, Lappert, et al., 1972
Baldwin, J.C.; Lappert, M.F.; Pedley, J.B.; Poland, J.S.,
J. Chem. Soc., Dalton Trans., 1972, 1943.. [all data]
Hao, Kaspar, et al., 2005
Hao, C.T.; Kaspar, J.D.; Check, C.E.; Lobring, K.C.; Gilbert, T.M.; Sunderlin, L.S.,
Effect of substituents on the strength of A-Cl- (A = Si, Ge, and Sn) bonds in hypervalent systems: ACl(5)(-), ACl(4)F(-), and A(CH3)(3)Cl-2(-),
J. Phys. Chem. A, 2005, 109, 9, 2026-2034, https://doi.org/10.1021/jp040743x
. [all data]
Drake, Glavincevski, et al., 1979
Drake, J.E.; Glavincevski, B.M.; Gorzelska, K.,
The photoelectron spectra of trimethylgermane, chloro- and fluoro-trimethylgermane,
J. Electron Spectrosc. Relat. Phenom., 1979, 16, 331. [all data]
Tamas, Czira, et al., 1972
Tamas, J.; Czira, G.; Maltsev, A.K.; Nefedov, O.M.,
Electron impact studies on some organochlorogermanes: mass spectra and bond dissociation energies,
J. Organomet. Chem., 1972, 40, 311. [all data]
Flamini, Semprini, et al., 1976
Flamini, A.; Semprini, E.; Stefani, F.; Sorriso, S.; Cardaci, G.,
He(I) photoelectron spectra and semiempirical molecular-orbital calculations on methylmetal halides of group 4A elements,
J. Chem. Soc. Dalton Trans., 1976, 731. [all data]