1H-1,2,4-Triazole, 3-chloro-5-methyl-
- Formula: C3H4ClN3
- Molecular weight: 117.537
- IUPAC Standard InChIKey: AEDKVRCTAMEXHJ-UHFFFAOYSA-N
- CAS Registry Number: 15285-15-1
- Chemical structure:
View 3d structure (requires JavaScript / HTML 5) - Other names: s-Triazole, 3-chloro-5-methyl-

Gas phase ion energetics data

Data compiled by: Sharon G. Lias, Rhoda D. Levin, and Sherif A. Kafafi
Ionization energy determinations
IE (eV) | Method | Reference | Comment |
---|---|---|---|
9.6 | PE | Guimon, Pfister-Guillouzo, et al., 1980 | Vertical value |

References

Guimon, Pfister-Guillouzo, et al., 1980
Guimon, C.; Pfister-Guillouzo, G.; Bernardini, A.; Viallefont, P.,
A photoelectron study (HeI, HeII) of the tautomeric equilibrium of chloro- and bromo-1,2,4-triazoles,
Tetrahedron, 1980, 36, 1071. [all data]