Ethylidenecyclobutane
- Formula: C6H10
- Molecular weight: 82.1436
- IUPAC Standard InChIKey: FYHISAJRLZLAQP-UHFFFAOYSA-N
- CAS Registry Number: 1528-21-8
- Chemical structure:
View 3d structure (requires JavaScript / HTML 5) - Permanent link for this species. Use this link for bookmarking this species for future reference.

Phase change data

Data compiled by: Thermodynamics Research Center, NIST Boulder Laboratories, Chris Muzny director
Quantity | Value | Units | Method | Reference | Comment |
---|---|---|---|---|---|
Tboil | 353.41 | K | N/A | Derfer, Greenlee, et al., 1949 | Uncertainty assigned by TRC = 0.3 K |
Quantity | Value | Units | Method | Reference | Comment |
Tfus | 167.78 | K | N/A | Derfer, Greenlee, et al., 1949 | Uncertainty assigned by TRC = 0.2 K |

Gas phase ion energetics data

Data compiled as indicated in comments:
LLK - Sharon G. Lias, Rhoda D. Levin, and Sherif A. Kafafi
Ionization energy determinations
IE (eV) | Method | Reference | Comment |
---|---|---|---|
8.70 ± 0.05 | EI | Wolkoff, Holmes, et al., 1980 | LLK |
Appearance energy determinations
Ion | AE (eV) | Other Products | Method | Reference | Comment |
---|---|---|---|---|---|
C5H7+ | 9.88 ± 0.05 | CH3 | EI | Wolkoff, Holmes, et al., 1980 | LLK |

References

Derfer, Greenlee, et al., 1949
Derfer, J.M.; Greenlee, K.W.; Boord, C.E.,
A New Synthesis of Monoalkylcyclobutanes: Reduction of Neopentyl Type Tribromides,
J. Am. Chem. Soc., 1949, 71, 175. [all data]
Wolkoff, Holmes, et al., 1980
Wolkoff, P.; Holmes, J.L.; Lossing, F.P.,
On the formation of cyclopentenium cations from all C6H10+ molecular ion structures,
Can. J. Chem., 1980, 58, 251. [all data]