Stannane, butyltrimethyl-
- Formula: C7H18Sn
- Molecular weight: 220.928
- IUPAC Standard InChIKey: ISGCVUHZDITLMD-UHFFFAOYSA-N
- CAS Registry Number: 1527-99-7
- Chemical structure:
View 3d structure (requires JavaScript / HTML 5) - Other names: Butyltrimethylstannane; Trimethylbutyltin; Tin, butyltrimethyl-

Gas phase ion energetics data

Data compiled by: Henry M. Rosenstock, Keith Draxl, Bruce W. Steiner, and John T. Herron
Appearance energy determinations
Ion | AE (eV) | Other Products | Method | Reference | Comment |
---|---|---|---|---|---|
C3H9Sn+ | 9.80 ± 0.04 | ? | EI | Yergey and Lampe, 1968 | |
C6H15Sn+ | 9.67 ± 0.09 | CH3 | EI | Yergey and Lampe, 1968 |

Normal alkane RI, non-polar column, temperature ramp

Column type | Active phase | I | Reference | Comment |
---|---|---|---|---|
Capillary | BP-1 | 827.9 | Rosales, Pablos, et al., 1992 | 12. m/0.53 mm/3. μm, He, 10. K/min; Tstart: 50. C; Tend: 250. C |

References

Yergey and Lampe, 1968
Yergey, A.L.; Lampe, F.W.,
An electron impact study of ionization and dissociation of trimethylstannanes,
J. Organometal. Chem., 1968, 15, 339. [all data]
Rosales, Pablos, et al., 1992
Rosales, D.; Pablos, F.; Marr, I.L.,
Speciation and GC retention indices of some organotin compounds in water,
Appl. Organomet. Chem., 1992, 6, 1, 27-38, https://doi.org/10.1002/aoc.590060105
. [all data]