m-Methoxybenzontrile
- Formula: C8H7NO
- Molecular weight: 133.1473
- IUPAC Standard InChIKey: KLXSUMLEPNAZFK-UHFFFAOYSA-N
- CAS Registry Number: 1527-89-5
- Chemical structure:
View 3d structure (requires JavaScript / HTML 5) - Other names: m-Methoxybenzonitrile; 3-Methoxybenzonitrile; Benzonitrile, 3-methoxy-; m-Anisonitrile; m-Cyanoanisole; Benzonitrile, m-methoxy-

Phase change data

Data compiled by: Robert L. Brown and Stephen E. Stein
Reduced pressure boiling point
Tboil (K) | Pressure (bar) | Reference |
---|---|---|
384.7 | 0.017 | Weast and Grasselli, 1989 |

Gas phase ion energetics data

Data compiled by: Henry M. Rosenstock, Keith Draxl, Bruce W. Steiner, and John T. Herron
Ionization energy determinations
IE (eV) | Method | Reference |
---|---|---|
9.05 ± 0.04 | EI | Buchs, 1970 |
9.1 ± 0.1 | EI | Brown, 1970 |
Appearance energy determinations
Ion | AE (eV) | Other Products | Method | Reference | Comment |
---|---|---|---|---|---|
C7H4NO+ | 12.8 ± 0.1 | CH3 | EI | Brown, 1970 | |
C7H5N+ | 12.2 ± 0.1 | CH2O | EI | Brown, 1970 |

References

Weast and Grasselli, 1989
CRC Handbook of Data on Organic Compounds, 2nd Editon, Weast,R.C and Grasselli, J.G., ed(s)., CRC Press, Inc., Boca Raton, FL, 1989, 1. [all data]
Buchs, 1970
Buchs, A.,
Etude par spectrometrie de masse de l'ionisation de benzonitriles, de phenylacetonitriles et de N,N-dimethylanilines substitues,
Helv. Chim. Acta, 1970, 53, 2026. [all data]
Brown, 1970
Brown, P.,
Kinetic studies in mass spectrometry. VIII. Competing [M-CH3] and [M-CH2O] reactions in substituted anisoles. Approximate activation energies from ionization appearance potentials,
Org. Mass Spectrom., 1970, 4, 519. [all data]