Tri-ruthenium dodecacarbonyl
- Formula: C12O12Ru3
- Molecular weight: 639.33
- IUPAC Standard InChIKey: NQZFAUXPNWSLBI-UHFFFAOYSA-N
- CAS Registry Number: 15243-33-1
- Chemical structure:

Phase change data

Data compiled by: José A. Martinho Simões
Quantity | Value | Units | Method | Reference | Comment |
---|---|---|---|---|---|
ΔsubH° | 105. ± 20. | kJ/mol | TD-HFC | Baev, Connor, et al., 1981 |

Reaction thermochemistry data

Data compiled by: José A. Martinho Simões
Individual Reactions
(solution) + 3
(solution) = 3C5O5Ru (solution)
By formula: C12O12Ru3 (solution) + 3CO (solution) = 3C5O5Ru (solution)
Quantity | Value | Units | Method | Reference | Comment |
---|---|---|---|---|---|
ΔrH° | -13.0 ± 1.1 | kJ/mol | EqS | Koelliker and Bor, 1991 | solvent: Isooctane; Temperature range: 373-448 K |
ΔrH° | -27.1 ± 1.9 | kJ/mol | EqS | Bor, 1986 | solvent: n-Hexane; Temperature range: ca. 348-448 K |
By formula: C12O12Ru3 (cr) = 12CO (g) + 3Ru (cr)
Quantity | Value | Units | Method | Reference | Comment |
---|---|---|---|---|---|
ΔrH° | 577. ± 13. | kJ/mol | TD-HFC | Baev, Connor, et al., 1981 | |
ΔrH° | 594. ± 17. | kJ/mol | TD-HFC | Connor, Skinner, et al., 1973 | Please also see Pedley and Rylance, 1977. |

Gas phase ion energetics data

Data compiled as indicated in comments:
LLK - Sharon G. Lias, Rhoda D. Levin, and Sherif A. Kafafi
Ionization energy determinations
IE (eV) | Method | Reference | Comment |
---|---|---|---|
7.5 | PE | Green, Mingos, et al., 1981 | Vertical value; LLK |
7.7 ± 0.2 | PE | Green, Seddon, et al., 1979 | Vertical value; LLK |
7.91 | PE | Ajo, Granozzi, et al., 1979 | Vertical value; LLK |

Gas phase thermochemistry data

Data compiled by: José A. Martinho Simões
Quantity | Value | Units | Method | Reference | Comment |
---|---|---|---|---|---|
ΔfH°gas | -1816. ± 26. | kJ/mol | Review | Martinho Simões | |
ΔfH°gas | -1798. ± 24. | kJ/mol | Review | Martinho Simões | Selected data |

Condensed phase thermochemistry data

Data compiled by: José A. Martinho Simões
Quantity | Value | Units | Method | Reference | Comment |
---|---|---|---|---|---|
ΔfH°solid | -1921. ± 17. | kJ/mol | Review | Martinho Simões | |
ΔfH°solid | -1903. ± 13. | kJ/mol | Review | Martinho Simões | Selected data |

References

Baev, Connor, et al., 1981
Baev, A.K.; Connor, J.A.; El-Saied, N.I.; Skinner H.A.,
J. Organometal. Chem., 1981, 213, 151. [all data]
Koelliker and Bor, 1991
Koelliker, R.; Bor, G.,
J. Organometal. Chem., 1991, 417, 439. [all data]
Bor, 1986
Bor, G.,
Pure & Appl. Chem., 1986, 58, 543. [all data]
Connor, Skinner, et al., 1973
Connor, J.A.; Skinner, H.A.; Virmani, Y.,
High temperature microcalorimetric studies of the thermal decomposition and iodination of polynuclear carbonyls of Fe, Co, Ru, Rh, Re, Os and Ir,
Faraday Symp. Chem. Soc., 1973, 8, 18, https://doi.org/10.1039/fs9730800018
. [all data]
Pedley and Rylance, 1977
Pedley, J.B.; Rylance, J.,
Computer Analysed Thermochemical Data: Organic and Organometallic Compounds, University of Sussex, Brigton, 1977. [all data]
Green, Mingos, et al., 1981
Green, J.C.; Mingos, D.M.P.; Seddon, E.A.,
Ultraviolet photoelectron studies on bonding in some metal carbonyl and metal hydrido carbonyl clusters,
Inorg. Chem., 1981, 20, 2595. [all data]
Green, Seddon, et al., 1979
Green, J.C.; Seddon, E.A.; Mingos, D.M.P.,
U.V. photoelectron spectral studies on the metal carbonyl cluster compounds Os3(CO)12, Ru3(CO)12, and Os6(CO)18,
J. Chem. Soc., Chem. Commun., 1979, 94. [all data]
Ajo, Granozzi, et al., 1979
Ajo, D.; Granozzi, G.; Tondello, E.; Fragala, I.,
Nature of the metal-metal bond in triangulo-Ru3(CO)12 from UV photoelectron spectroscopy and quantum mechanical calculations,
Inorg. Chim. Acta, 1979, 37, 191. [all data]