Cyclohexene,3-(2-propenyl)-
- Formula: C9H14
- Molecular weight: 122.2075
- IUPAC Standard InChIKey: RGURBRHZWFDJBM-UHFFFAOYSA-N
- CAS Registry Number: 15232-95-8
- Chemical structure:
View 3d structure (requires JavaScript / HTML 5) - Other names: 3-Allylcyclohexene; 3-Allylcyclohexene-1

Gas phase ion energetics data

Data compiled by: Sharon G. Lias, Rhoda D. Levin, and Sherif A. Kafafi
Ionization energy determinations
IE (eV) | Method | Reference |
---|---|---|
8.83 ± 0.02 | PE | Rang, Paldoia, et al., 1974 |

Kovats' RI, non-polar column, isothermal

Column type | Active phase | Temperature (C) | I | Reference | Comment |
---|---|---|---|---|---|
Capillary | Apiezon L | 100. | 962. | Eisen, Orav, et al., 1972 | Column length: 45. m; Column diameter: 0.25 mm |
Capillary | Squalane | 60. | 917.0 | Eisen, Orav, et al., 1972 | Column length: 80. m; Column diameter: 0.25 mm |
Capillary | Squalane | 80. | 923.0 | Eisen, Orav, et al., 1972 | Column length: 80. m; Column diameter: 0.25 mm |
Capillary | Squalane | 60. | 917. | Orav and Eisen, 1972 | Column length: 80. m; Column diameter: 0.25 mm |
Capillary | Squalane | 80. | 923. | Orav and Eisen, 1972 | Column length: 80. m; Column diameter: 0.25 mm |

Kovats' RI, polar column, isothermal

Column type | Active phase | Temperature (C) | I | Reference | Comment |
---|---|---|---|---|---|
Capillary | PEG 4000 | 100. | 1142. | Rang, Orav, et al., 1988 | |
Capillary | PEG 4000 | 60. | 1122. | Rang, Orav, et al., 1988 | |
Capillary | PEG 4000 | 80. | 1132. | Rang, Orav, et al., 1988 | |
Capillary | Polyethylene Glycol 4000 | 100. | 1142.2 | Eisen, Orav, et al., 1972 | Column length: 80. m; Column diameter: 0.25 mm |
Capillary | Polyethylene Glycol 4000 | 60. | 1122.2 | Eisen, Orav, et al., 1972 | Column length: 80. m; Column diameter: 0.25 mm |
Capillary | Polyethylene Glycol 4000 | 80. | 1131.7 | Eisen, Orav, et al., 1972 | Column length: 80. m; Column diameter: 0.25 mm |
Capillary | PEG 4000 | 100. | 1142.2 | Orav and Eisen, 1972 | Column length: 80. m; Column diameter: 0.25 mm |
Capillary | PEG 4000 | 60. | 1122.2 | Orav and Eisen, 1972 | Column length: 80. m; Column diameter: 0.25 mm |
Capillary | PEG 4000 | 80. | 1131.7 | Orav and Eisen, 1972 | Column length: 80. m; Column diameter: 0.25 mm |

Van Den Dool and Kratz RI, non-polar column, temperature ramp

Column type | Active phase | I | Reference | Comment |
---|---|---|---|---|
Capillary | DB-Petro | 876.4 | Pang T., Zhu S., et al., 2007 | 50. m/0.2 mm/0.5 μm, 2. K/min; Tstart: 50. C; Tend: 270. C |
Capillary | DB-Petro | 876.4 | Pang T., Zhu S., et al., 2007 | 50. m/0.2 mm/0.5 μm, 2. K/min; Tstart: 50. C; Tend: 270. C |

References

Rang, Paldoia, et al., 1974
Rang, S.; Paldoia, P.; Talvari, A.,
Ionization potentials of unsaturated hydrocarbons. 2. Mono-substituted cyclopentenes and cyclohexenes,
Eesti. NSV Tead. Akad. Toim., 1974, 354. [all data]
Eisen, Orav, et al., 1972
Eisen, O.; Orav, A.; Rang, S.,
Identifizierung von Normal-Alkenen, Cyclopentenen und -Hexenen mittels Kapillar-Gas-Chromatographie. Identification des alcènes, cyclopentènes et -hexènes à l'aide de la chromatogrpahie en phase gazeuse sur colonne capillaire,
Chromatographia, 1972, 5, 11, 229-239, https://doi.org/10.1007/BF02270600
. [all data]
Orav and Eisen, 1972
Orav, A.; Eisen, O.,
The retention indexes for alkenes, alkynes and cyclenes on capillary columns,
Izv. Akad. Nauk Est. SSR, Khim. Geol., 1972, 21, 1, 39-47. [all data]
Rang, Orav, et al., 1988
Rang, S.A.; Orav, A.E.; Kuningas, K.R.; Meister, A.E.; Strense, T.V.; Eisen, O.G.,
Gas-Chromatographic Characteristics of unsaturated hydrocarbons, Academy of Sciences of Estonia SSR, Tallinn, Estonia SSR, 1988, 208. [all data]
Pang T., Zhu S., et al., 2007
Pang T.; Zhu S.; Lu X.; Xu G.,
Identification of unknown compounds on the basis of retention index data in comprehensive two-dimensional gas chromatography,
J. Sep. Sci., 2007, 30, 6, 868-874, https://doi.org/10.1002/jssc.200600471
. [all data]