1-Heptylcyclohexene
- Formula: C13H24
- Molecular weight: 180.3297
- IUPAC Standard InChIKey: XDUFGMTUKHRHSO-UHFFFAOYSA-N
- CAS Registry Number: 15232-86-7
- Chemical structure:
View 3d structure (requires JavaScript / HTML 5) - Other names: Cyclohexene,1-heptyl-; 1-Heptyl-1-cyclohexene

Gas phase ion energetics data

Data compiled as indicated in comments:
LLK - Sharon G. Lias, Rhoda D. Levin, and Sherif A. Kafafi
Ionization energy determinations
IE (eV) | Method | Reference | Comment |
---|---|---|---|
8.37 ± 0.02 | PE | Rang, Paldoia, et al., 1974 | LLK |

Kovats' RI, non-polar column, isothermal

Column type | Active phase | Temperature (C) | I | Reference | Comment |
---|---|---|---|---|---|
Capillary | Squalane | 100. | 1344. | Rang, Orav, et al., 1977 | Nitrogen or helium; Column length: 100. m; Column diameter: 0.25 mm |

Kovats' RI, polar column, isothermal

Column type | Active phase | Temperature (C) | I | Reference | Comment |
---|---|---|---|---|---|
Capillary | PEG 4000 | 100. | 1486. | Rang, Orav, et al., 1988 | |
Capillary | PEG 4000 | 110. | 1498. | Rang, Orav, et al., 1988 | |
Capillary | PEG 4000 | 120. | 1501. | Rang, Orav, et al., 1988 | |
Capillary | PEG 4000 | 150. | 1513. | Rang, Orav, et al., 1988 | |
Capillary | PEG 4000 | 160. | 1518. | Rang, Orav, et al., 1988 | |
Capillary | PEG-20M | 100. | 1470. | Rang, Orav, et al., 1988 | |
Capillary | PEG-20M | 110. | 1477. | Rang, Orav, et al., 1988 | |
Capillary | PEG-20M | 120. | 1482. | Rang, Orav, et al., 1988 | |
Capillary | PEG-20M | 130. | 1488. | Rang, Orav, et al., 1988 | |
Capillary | PEG-20M | 140. | 1493. | Rang, Orav, et al., 1988 | |
Capillary | PEG-20M | 150. | 1499. | Rang, Orav, et al., 1988 | |
Capillary | PEG-20M | 160. | 1504. | Rang, Orav, et al., 1988 | |
Capillary | PEG-20M | 110. | 1476.8 | Orav, Kuningas, et al., 1982 | He; Column length: 100. m; Column diameter: 0.25 mm |
Capillary | PEG-20M | 120. | 1482.5 | Orav, Kuningas, et al., 1982 | He; Column length: 100. m; Column diameter: 0.25 mm |
Capillary | PEG-20M | 130. | 1488.2 | Orav, Kuningas, et al., 1982 | He; Column length: 100. m; Column diameter: 0.25 mm |
Capillary | PEG-20M | 140. | 1493.4 | Orav, Kuningas, et al., 1982 | He; Column length: 100. m; Column diameter: 0.25 mm |
Capillary | PEG-20M | 150. | 1499.1 | Orav, Kuningas, et al., 1982 | He; Column length: 100. m; Column diameter: 0.25 mm |
Capillary | PEG-20M | 160. | 1503.9 | Orav, Kuningas, et al., 1982 | He; Column length: 100. m; Column diameter: 0.25 mm |
Capillary | PEG 4000 | 100. | 1486. | Rang, Orav, et al., 1977 | Nitrogen or Helium; Column length: 45. m; Column diameter: 0.25 mm |

Normal alkane RI, non-polar column, custom temperature program

Column type | Active phase | I | Reference | Comment |
---|---|---|---|---|
Capillary | Squalane | 1342. | Chen, 2008 | Program: not specified |

References

Rang, Paldoia, et al., 1974
Rang, S.; Paldoia, P.; Talvari, A.,
Ionization potentials of unsaturated hydrocarbons. 2. Mono-substituted cyclopentenes and cyclohexenes,
Eesti. NSV Tead. Akad. Toim., 1974, 354. [all data]
Rang, Orav, et al., 1977
Rang, S.; Orav, A.; Kuningas, K.; Eisen, O.,
Capillary Gas Chromatography of Monosubstituted Cyclopentenes and Cyclohexenes,
Chromatographia, 1977, 10, 3, 115-122, https://doi.org/10.1007/BF02297862
. [all data]
Rang, Orav, et al., 1988
Rang, S.A.; Orav, A.E.; Kuningas, K.R.; Meister, A.E.; Strense, T.V.; Eisen, O.G.,
Gas-Chromatographic Characteristics of unsaturated hydrocarbons, Academy of Sciences of Estonia SSR, Tallinn, Estonia SSR, 1988, 208. [all data]
Orav, Kuningas, et al., 1982
Orav, A.; Kuningas, K.; Rang, S.; Eisen, O.,
Capillary gas chromatography of monosubstituted cyclopentenes and cyclohexenes C8-C15 on polyethylene glycol 20M,
Eesti NSV Tead. Akad. Toim. Keem., 1982, 40-49. [all data]
Chen, 2008
Chen, H.-F.,
Quantitative prediction of gas chromatography retention indices with support vector machines, radial basis neutral networks and multiple linear regression,
Anal. Chim. Acta, 2008, 609, 1, 24-36, https://doi.org/10.1016/j.aca.2008.01.003
. [all data]