Acetic acid, 3-nitrophenyl ester
- Formula: C8H7NO4
- Molecular weight: 181.1455
- IUPAC Standard InChIKey: HRMRLUUZPLAPAS-UHFFFAOYSA-N
- CAS Registry Number: 1523-06-4
- Chemical structure:
View 3d structure (requires JavaScript / HTML 5) - Permanent link for this species. Use this link for bookmarking this species for future reference.

Gas phase ion energetics data

Data compiled by: Sharon G. Lias, Rhoda D. Levin, and Sherif A. Kafafi
Ionization energy determinations
IE (eV) | Method | Reference |
---|---|---|
9.4 ± 0.2 | EI | Gamble, Gilbert, et al., 1971 |
Appearance energy determinations
Ion | AE (eV) | Other Products | Method | Reference | Comment |
---|---|---|---|---|---|
C2H3O+ | 10.9 ± 0.2 | ? | EI | Gamble, Gilbert, et al., 1971 | |
C6H5NO3+ | 10.9 ± 0.2 | CH2=C=O | EI | Gamble, Gilbert, et al., 1971 |

Van Den Dool and Kratz RI, non-polar column, temperature ramp

Column type | Active phase | I | Reference | Comment |
---|---|---|---|---|
Capillary | ZB-1 | 1348. | Urbanczyk, Staniewski, et al., 2002 | 30. m/0.25 mm/0.50 μm, He, 50. C @ 3. min, 10. K/min, 280. C @ 10. min |

References

Gamble, Gilbert, et al., 1971
Gamble, A.A.; Gilbert, J.R.; Tillett, J.G.,
Substituent effects on the mass spectra of substituted phenyl acetates,
Org. Mass Spectrom., 1971, 5, 1093. [all data]
Urbanczyk, Staniewski, et al., 2002
Urbanczyk, A.; Staniewski, J.; Szymanowski, J.,
Abraham model in gas chromatography of phenol pollutants,
Anal. Chim. Acta., 2002, 466, 1, 151-159, https://doi.org/10.1016/S0003-2670(02)00544-5
. [all data]