Tungsten, pentacarbonyl(trimethylamine)-
- Formula: C8H9NO5W
- Molecular weight: 383.00
- CAS Registry Number: 15228-32-7

Phase change data

Data compiled by: José A. Martinho Simões
Quantity | Value | Units | Method | Reference | Comment |
---|---|---|---|---|---|
ΔsubH° | 89.1 ± 2.1 | kJ/mol | N/A | Boxhoorn, Ernsting, et al., 1980 |

Gas phase ion energetics data

Data compiled by: Sharon G. Lias, Rhoda D. Levin, and Sherif A. Kafafi
Ionization energy determinations
IE (eV) | Method | Reference | Comment |
---|---|---|---|
7.41 | PE | Higginson, Lloyd, et al., 1974 | Vertical value |

References

Boxhoorn, Ernsting, et al., 1980
Boxhoorn, G.; Ernsting, J.M.; Stufkens, D.J.; Oskam, A.,
Thermochim. Acta, 1980, 42, 315. [all data]
Higginson, Lloyd, et al., 1974
Higginson, B.R.; Lloyd, D.R.; Connor, J.A.; Hillier, I.H.,
Photoelectron studies of metal carbonyls. Part 4. Mono-substituted complexes of chromium tungsten carbonyls, J. Chem Soc.,
J. Chem. Soc. Faraday Trans. 2, 1974, 70, 1418. [all data]