Chromium, pentacarbonyl(trimethylamine)-

Gas phase ion energetics data

Data compiled by: Sharon G. Lias, Rhoda D. Levin, and Sherif A. Kafafi

Ionization energy determinations

IE (eV) Method Reference Comment
7.45PEHigginson, Lloyd, et al., 1974Vertical value

References

Higginson, Lloyd, et al., 1974
Higginson, B.R.; Lloyd, D.R.; Connor, J.A.; Hillier, I.H., Photoelectron studies of metal carbonyls. Part 4. Mono-substituted complexes of chromium tungsten carbonyls, J. Chem Soc., J. Chem. Soc. Faraday Trans. 2, 1974, 70, 1418. [all data]