3-Penten-2-one, 4-hydroxy-
- Formula: C5H8O2
- Molecular weight: 100.1158
- IUPAC Standard InChIKey: POILWHVDKZOXJZ-ARJAWSKDSA-N
- CAS Registry Number: 1522-20-9
- Chemical structure:
View 3d structure (requires JavaScript / HTML 5) - Permanent link for this species. Use this link for bookmarking this species for future reference.

Gas phase thermochemistry data

Data compiled by: Hussein Y. Afeefy, Joel F. Liebman, and Stephen E. Stein
Quantity | Value | Units | Method | Reference | Comment |
---|---|---|---|---|---|
ΔfH°gas | -385.3 ± 2.0 | kJ/mol | Cm | Melia and Merrifield, 1969 | Thermochemical cycle |

Condensed phase thermochemistry data

Data compiled as indicated in comments:
ALS - Hussein Y. Afeefy, Joel F. Liebman, and Stephen E. Stein
DH - Eugene S. Domalski and Elizabeth D. Hearing
Quantity | Value | Units | Method | Reference | Comment |
---|---|---|---|---|---|
ΔfH°liquid | -426.3 ± 2.0 | kJ/mol | Cm | Melia and Merrifield, 1969 | Thermochemical cycle; ALS |
Quantity | Value | Units | Method | Reference | Comment |
S°liquid | 261.4 | J/mol*K | N/A | Melia and Merrifield, 1969 | Extrapolated below 90 K. S(298.15 K) given as 2.611 J/g*K.; DH |
Constant pressure heat capacity of liquid
Cp,liquid (J/mol*K) | Temperature (K) | Reference | Comment |
---|---|---|---|
208.2 | 298.15 | Melia and Merrifield, 1969 | T = 80 to 300 K. Csat(liq) = 0.8978 + 3.964x10-3T J/g*K (260 to 300 K); Csat(298.15 K) given as 2.080 J/g*K.; DH |

Phase change data

Data compiled as indicated in comments:
DH - Eugene S. Domalski and Elizabeth D. Hearing
AC - William E. Acree, Jr., James S. Chickos
Enthalpy of fusion
ΔfusH (kJ/mol) | Temperature (K) | Reference | Comment |
---|---|---|---|
14.497 | 254.8 | Melia and Merrifield, 1969 | DH |
14.5 | 254.8 | Melia and Merrifield, 2007 | AC |
Entropy of fusion
ΔfusS (J/mol*K) | Temperature (K) | Reference | Comment |
---|---|---|---|
56.90 | 254.8 | Melia and Merrifield, 1969 | DH |

Reaction thermochemistry data

Data compiled by: Hussein Y. Afeefy, Joel F. Liebman, and Stephen E. Stein
Individual Reactions
By formula: C5H8O2 = C5H8O2
Quantity | Value | Units | Method | Reference | Comment |
---|---|---|---|---|---|
ΔrH° | -7.9 ± 0.4 | kJ/mol | Kin | Schweig, Vermeer, et al., 1974 | liquid phase; Photoelectron spectroscopy |
ΔrH° | -10. ± 0.8 | kJ/mol | Eqk | Thompson and Allred, 1971 | liquid phase; solvent: Cyclohexane; NMR, UV |
ΔrH° | -12. ± 0.8 | kJ/mol | Eqk | Calmon, 1969 | liquid phase |
By formula: C5H8O2 = C5H8O2
Quantity | Value | Units | Method | Reference | Comment |
---|---|---|---|---|---|
ΔrH° | 16.8 | kJ/mol | Eqk | Mines and Thompson, 1975 | gas phase |

Gas phase ion energetics data

Data compiled by: Sharon G. Lias, John E. Bartmess, Joel F. Liebman, John L. Holmes, Rhoda D. Levin, and W. Gary Mallard
Ionization energy determinations
IE (eV) | Method | Reference | Comment |
---|---|---|---|
9.08 ± 0.01 | PE | Hush, Livett, et al., 1987 | Vertical value |

References

Melia and Merrifield, 1969
Melia, T.P.; Merrifield, R.,
Thermal properties of acetylacetone,
J. Appl. Chem., 1969, 19, 79-82. [all data]
Melia and Merrifield, 2007
Melia, T.P.; Merrifield, R.,
Thermal properties of acetylacetone,
J. Appl. Chem., 2007, 19, 3, 79-82, https://doi.org/10.1002/jctb.5010190305
. [all data]
Schweig, Vermeer, et al., 1974
Schweig, A.; Vermeer, H.; Weidner, U.,
A photoelectron spectroscopic study of keto-enol tautomerism in acetylacetones - a new application of photoelectron spectroscopy,
Chem. Phys. Lett., 1974, 26, 229-233. [all data]
Thompson and Allred, 1971
Thompson, D.W.; Allred, A.L.,
Keto-enol equilibria in 2,4-Pentanedione and 3,3-dideuterio-2,4-pentanedione,
J. Phys. Chem., 1971, 75, 433-435. [all data]
Calmon, 1969
Calmon, J.P.,
Thermodynamic functions of enolization of aliphatic β-diketones,
C. R. Acad. Sci. Paris, 1969, 268, 1435-1438. [all data]
Mines and Thompson, 1975
Mines, G.W.; Thompson, H.,
Infrared and photoelectron spectra, and keto-enol tautomerism of acetylacetones and acetoacetic esters,
Proc. Roy. Soc. London A, 1975, 342, 327-339. [all data]
Hush, Livett, et al., 1987
Hush, N.S.; Livett, M.K.; Peel, J.B.; Willett, G.D.,
Variable-temperature ultraviolet photoelectron spectroscopy of the keto-enol tautomers of pentane-2,4-dione,
Aust. J. Chem., 1987, 40, 599. [all data]