Phosphorothioic acid, O,O,S-trimethyl ester
- Formula: C3H9O3PS
- Molecular weight: 156.141
- IUPAC Standard InChIKey: WTUNGUOZHBRADH-UHFFFAOYSA-N
- CAS Registry Number: 152-20-5
- Chemical structure:
View 3d structure (requires JavaScript / HTML 5) - Other names: Dimethylthiomethylphosphate; HC 7901; Methyl Phosphorothioate ((meo)2(mes)po); O,O-Dimethyl S-methyl phosphorothioate; 8000 BIS HC; O,O,S-Trimethyl phosphorothioate; Phosphorothioic acid, o,o',s-trimethyl ester

Gas phase ion energetics data

Data compiled by: Sharon G. Lias, Rhoda D. Levin, and Sherif A. Kafafi
Ionization energy determinations
IE (eV) | Method | Reference |
---|---|---|
9.55 ± 0.10 | EI | Santoro, 1973 |
Appearance energy determinations
Ion | AE (eV) | Other Products | Method | Reference | Comment |
---|---|---|---|---|---|
CH3+ | 15.20 ± 0.30 | ? | EI | Santoro, 1973 | |
CH3S+ | 13.1 ± 0.30 | ? | EI | Santoro, 1973 | |
CH4O2P+ | 12.25 ± 0.20 | CH3S+HCHO | EI | Santoro, 1973 | |
CH4O3P+ | 13.20 ± 0.20 | HCHS+CH3 | EI | Santoro, 1973 | |
CH5O2P+ | 12.35 ± 0.20 | HCHS+HCHO | EI | Santoro, 1973 | |
C2H6O2PS+ | 11.82 ± 0.20 | CH3O | EI | Santoro, 1973 | |
C2H6O3P+ | 11.90 ± 0.10 | CH3S | EI | Santoro, 1973 | |
C2H6O3PS+ | 10.03 ± 0.10 | CH3 | EI | Santoro, 1973 | |
C2H7O2PS+ | 10.51 ± 0.10 | HCHO | EI | Santoro, 1973 | |
C2H7O3P+ | 11.00 ± 0.10 | HCHS | EI | Santoro, 1973 |

References

Santoro, 1973
Santoro, E.,
The fragmentation of some alkyl thiophosphate esters by electron-impact,
Org. Mass Spectrom., 1973, 7, 589. [all data]