oxalyl bromide
- Formula: C2Br2O2
- Molecular weight: 215.828
- IUPAC Standard InChIKey: JAZLVNXWYDFQFE-UHFFFAOYSA-N
- CAS Registry Number: 15219-34-8
- Chemical structure:
View 3d structure (requires JavaScript / HTML 5) - Permanent link for this species. Use this link for bookmarking this species for future reference.

Phase change data

Data compiled by: Robert L. Brown and Stephen E. Stein
Reduced pressure boiling point
Tboil (K) | Pressure (bar) | Reference |
---|---|---|
289.7 | 0.013 | Aldrich Chemical Company Inc., 1990 |
375.7 | 0.960 | Weast and Grasselli, 1989 |

Gas phase ion energetics data

Data compiled as indicated in comments:
LLK - Sharon G. Lias, Rhoda D. Levin, and Sherif A. Kafafi
Ionization energy determinations
IE (eV) | Method | Reference | Comment |
---|---|---|---|
10.3 | PE | Kimura, Katsumata, et al., 1981 | LLK |
10.5 ± 0.1 | PE | Frost, McDowell, et al., 1977 | LLK |
10.77 | PE | Kimura, Katsumata, et al., 1981 | Vertical value; LLK |

References

Aldrich Chemical Company Inc., 1990
Aldrich Chemical Company Inc.,
Catalog Handbook of Fine Chemicals, Aldrich Chemical Company, Inc., Milwaukee WI, 1990, 1. [all data]
Weast and Grasselli, 1989
CRC Handbook of Data on Organic Compounds, 2nd Editon, Weast,R.C and Grasselli, J.G., ed(s)., CRC Press, Inc., Boca Raton, FL, 1989, 1. [all data]
Kimura, Katsumata, et al., 1981
Kimura, K.; Katsumata, S.; Achiba, Y.; Yamazaki, T.; Iwata, S.,
Ionization energies, Ab initio assignments, and valence electronic structure for 200 molecules
in Handbook of HeI Photoelectron Spectra of Fundamental Organic Compounds, Japan Scientific Soc. Press, Tokyo, 1981. [all data]
Frost, McDowell, et al., 1977
Frost, D.C.; McDowell, C.A.; Pouzard, G.; Westwood, N.P.C.,
The photoelectron spectra of the oxalyl halides (COX)2,[X = F, Cl and Br],
J. Electron Spectrosc. Relat. Phenom., 1977, 10, 273. [all data]