chlorotrimethylplumbane
- Formula: C3H9ClPb
- Molecular weight: 287.8
- IUPAC Standard InChIKey: HPQRSQFZILKRDH-UHFFFAOYSA-M
- CAS Registry Number: 1520-78-1
- Chemical structure:
View 3d structure (requires JavaScript / HTML 5) - Other names: Trimethyllead chloride

Gas phase ion energetics data

Data compiled by: Sharon G. Lias, Rhoda D. Levin, and Sherif A. Kafafi
Ionization energy determinations
IE (eV) | Method | Reference | Comment |
---|---|---|---|
9.70 | PE | Flamini, Semprini, et al., 1976 | Vertical value |

References

Flamini, Semprini, et al., 1976
Flamini, A.; Semprini, E.; Stefani, F.; Sorriso, S.; Cardaci, G.,
He(I) photoelectron spectra and semiempirical molecular-orbital calculations on methylmetal halides of group 4A elements,
J. Chem. Soc. Dalton Trans., 1976, 731. [all data]