(E,E,E)-2,4,6-Octatriene
- Formula: C8H12
- Molecular weight: 108.1809
- IUPAC Standard InChIKey: CGMDPTNRMYIZTM-NKYSMPERSA-N
- CAS Registry Number: 15192-80-0
- Chemical structure:
View 3d structure (requires JavaScript / HTML 5) - Stereoisomers:
- Other names: s2,4,6-Octatriene, (E,E,E)-; (E,E,E)-CH3CH=CHCH=CHCH=CHCH3; 2,4,6-Octatriene, (E,E,E)-

Gas phase ion energetics data

Data compiled by: Sharon G. Lias, Rhoda D. Levin, and Sherif A. Kafafi
Appearance energy determinations
Ion | AE (eV) | Other Products | Method | Reference | Comment |
---|---|---|---|---|---|
C8H12+ | 7.95 | ? | PE | Astrup, Bock, et al., 1975 | Vertical value |

References

Astrup, Bock, et al., 1975
Astrup, E.E.; Bock, H.; Wittel, K.; Heimbach, P.,
Photoelectron spectra and molecular properties. LIII. Methyl-substituent effects on the hexatriene π system,
Acta Chem. Scand. Ser. A:, 1975, 29, 827. [all data]