(E)-2-Butene-d8
- Formula: C4D8
- Molecular weight: 64.1556
- IUPAC Standard InChIKey: IAQRGUVFOMOMEM-BDYLZKADSA-N
- CAS Registry Number: 1517-55-1
- Chemical structure:
View 3d structure (requires JavaScript / HTML 5) - Isotopologues:

Gas phase ion energetics data

Data compiled by: Henry M. Rosenstock, Keith Draxl, Bruce W. Steiner, and John T. Herron
Ionization energy determinations
IE (eV) | Method | Reference |
---|---|---|
9.168 | S | McDiarmid, 1969 |

References

McDiarmid, 1969
McDiarmid, R.,
Rydberg progressions in cis- and trans-butene,
J. Chem. Phys., 1969, 50, 2328. [all data]