Platinum(II) acetylacetonate
- Formula: C10H14O4Pt
- Molecular weight: 393.300
- IUPAC Standard InChIKey: KLFRPGNCEJNEKU-FDGPNNRMSA-L
- CAS Registry Number: 15170-57-7
- Chemical structure:

Phase change data

Data compiled by: William E. Acree, Jr., James S. Chickos
Quantity | Value | Units | Method | Reference | Comment |
---|---|---|---|---|---|
ΔsubH° | 133. ± 9. | kJ/mol | N/A | Burkinshaw and Mortimer, 1984 |
Enthalpy of sublimation
ΔsubH (kJ/mol) | Temperature (K) | Method | Reference | Comment |
---|---|---|---|---|
129. ± 9. | 373. | ME | Burkinshaw and Mortimer, 1984 | Based on data from 363. to 383. K. |

Gas phase ion energetics data

Data compiled by: Sharon G. Lias, Rhoda D. Levin, and Sherif A. Kafafi
Ionization energy determinations
IE (eV) | Method | Reference | Comment |
---|---|---|---|
7.60 | PE | Fragala, Costanzo, et al., 1980 | Vertical value |

References

Burkinshaw and Mortimer, 1984
Burkinshaw, Philip M.; Mortimer, Colin T.,
Enthalpies of sublimation of transition metal complexes,
J. Chem. Soc., Dalton Trans., 1984, 1, 75, https://doi.org/10.1039/dt9840000075
. [all data]
Fragala, Costanzo, et al., 1980
Fragala, I.; Costanzo, L.L.; Ciliberto, E.; Condorelli, G.; D'Arrigo, C.,
He-I and He-II excited photoelectron spectra of tetracoordinated complexes of transition metal ions with β-diketonate ligands,
Inorg. Chim. Acta, 1980, 40, 15. [all data]