Iron, tris(3-bromopentan-2,4-dionato)-

Gas phase ion energetics data

Data compiled by: Sharon G. Lias and Joel F. Liebman

Ionization energy determinations

IE (eV) Method Reference Comment
7.94PEAkopyan, Vovna, et al., 1990Vertical value

References

Akopyan, Vovna, et al., 1990
Akopyan, M.E.; Vovna, V.I.; Kleimenov, S.N.; Lopatin, S.N.; Ustinov, A.Yu., Photoelectron spectroscopy of aluminum, chromium, and iron tris-B-diketonates, Opt. Spectrosc., 1990, 69, 53. [all data]