Chromium, tris(3-iodopentan-2,4-dionato)-
- Formula: C15H18CrI3O6
- Molecular weight: 727.0093
- CAS Registry Number: 15169-09-2

Gas phase ion energetics data

Data compiled as indicated in comments:
LL - Sharon G. Lias and Joel F. Liebman
RDSH - Henry M. Rosenstock, Keith Draxl, Bruce W. Steiner, and John T. Herron
Ionization energy determinations
IE (eV) | Method | Reference | Comment |
---|---|---|---|
8.03 ± 0.05 | EI | Bancroft, Reichert, et al., 1969 | RDSH |
7.51 | PE | Akopyan, Vovna, et al., 1990 | Vertical value; LL |
Appearance energy determinations
Ion | AE (eV) | Other Products | Method | Reference | Comment |
---|---|---|---|---|---|
C10H12O4I2Cr+ | 10.8 ± 0.10 | ? | EI | Bancroft, Reichert, et al., 1969 | RDSH |

References

Bancroft, Reichert, et al., 1969
Bancroft, G.M.; Reichert, C.; Westmore, J.B.; Gesser, H.D.,
Mass spectral studies of metal chelates. III. Mass spectra and appearance potentials of substituted acetylacetonates of trivalent chromium. Comparison with other trivalent metals of the first transition series,
Inorg. Chem., 1969, 8, 474. [all data]
Akopyan, Vovna, et al., 1990
Akopyan, M.E.; Vovna, V.I.; Kleimenov, S.N.; Lopatin, S.N.; Ustinov, A.Yu.,
Photoelectron spectroscopy of aluminum, chromium, and iron tris-B-diketonates,
Opt. Spectrosc., 1990, 69, 53. [all data]