Halothane
- Formula: C2HBrClF3
- Molecular weight: 197.382
- IUPAC Standard InChIKey: BCQZXOMGPXTTIC-UHFFFAOYSA-N
- CAS Registry Number: 151-67-7
- Chemical structure:
View 3d structure (requires JavaScript / HTML 5) - Other names: Ethane, 2-bromo-2-chloro-1,1,1-trifluoro-; Anestan; Fluktan; Fluorotane; Fluorothane; Fluothane; Ftorotan; Ftuorotan; Halan; Halotan; Halotano; Halothan; Halsan; Narcotan; Narcotane; Narkotan; CF3CHClBr; 1,1,1-Trifluoro-2-bromo-2-chloroethane; 2-Bromo-2-chloro-1,1,1-trifluoroethane; 1,1,1-Trifluoro-2-chloro-2-bromoethane; FREON 123B1; 1-Bromo-1-chloro-2,2,2-trifluoroethane; Bromochlorotrifluoroethane; 2,2,2-Trifluoro-1-chloro-1-bromoethane; Chalothane; Ethane, 1-bromo-1-chloro-2,2,2-trifluoro-; Narcotann ne-spofa; Rhodialothan; (.+/-.))-Halothane; Alotano; NSC 143490

Gas phase thermochemistry data

Data compiled by: Hussein Y. Afeefy, Joel F. Liebman, and Stephen E. Stein
Quantity | Value | Units | Method | Reference | Comment |
---|---|---|---|---|---|
ΔfH°gas | -699.9 ± 3.8 | kJ/mol | Ccr | Papina, Erastov, et al., 1981 | Reanalyzed by Kolesov and Papina, 1983, Original value = -690.4 ± 4.9 kJ/mol |

Condensed phase thermochemistry data

Data compiled as indicated in comments:
ALS - Hussein Y. Afeefy, Joel F. Liebman, and Stephen E. Stein
DH - Eugene S. Domalski and Elizabeth D. Hearing
Quantity | Value | Units | Method | Reference | Comment |
---|---|---|---|---|---|
ΔfH°liquid | -720.0 ± 4.9 | kJ/mol | Ccr | Papina, Erastov, et al., 1981 | ALS |
Quantity | Value | Units | Method | Reference | Comment |
ΔcH°liquid | -761.6 ± 3.2 | kJ/mol | Ccr | Papina, Erastov, et al., 1981 | ALS |
Constant pressure heat capacity of liquid
Cp,liquid (J/mol*K) | Temperature (K) | Reference | Comment |
---|---|---|---|
156.6 | 298.15 | Vesely, Zabransky, et al., 1988 | T = 298 to 318 K. Cp(J/mol*K) = 107.69 + 0.1639(T/K) (298 to 318 K).; DH |

Phase change data

Data compiled as indicated in comments:
BS - Robert L. Brown and Stephen E. Stein
TRC - Thermodynamics Research Center, NIST Boulder Laboratories, Chris Muzny director
AC - William E. Acree, Jr., James S. Chickos
ALS - Hussein Y. Afeefy, Joel F. Liebman, and Stephen E. Stein
DH - Eugene S. Domalski and Elizabeth D. Hearing
Quantity | Value | Units | Method | Reference | Comment |
---|---|---|---|---|---|
Tboil | 323.4 | K | N/A | Aldrich Chemical Company Inc., 1990 | BS |
Tboil | 596.4 | K | N/A | Francesconi, Comelli, et al., 1990 | Uncertainty assigned by TRC = 0.4 K; TRC |
Tboil | 323. | K | N/A | PCR Inc., 1990 | BS |
Tboil | 323.3 | K | N/A | Majer and Svoboda, 1985 | |
Tboil | 323.42 | K | N/A | Pashchenko and Varushchenko, 1985 | Uncertainty assigned by TRC = 0.01 K; TRC |
Quantity | Value | Units | Method | Reference | Comment |
Tfus | 157.4 | K | N/A | Golovanova and Kolesov, 1984 | Uncertainty assigned by TRC = 0.2 K; TRC |
Quantity | Value | Units | Method | Reference | Comment |
Tc | 496.3 | K | N/A | Majer and Svoboda, 1985 | |
Quantity | Value | Units | Method | Reference | Comment |
ΔvapH° | 29.8 | kJ/mol | N/A | Majer and Svoboda, 1985 | |
ΔvapH° | 29.8 ± 0.4 | kJ/mol | N/A | Varushchenko, Druzhinina, et al., 2007 | Based on data from 302. to 323. K. See also Pashchenko and Varushchenko, 1985.; AC |
ΔvapH° | 29.56 ± 0.33 | kJ/mol | V | Papina, Erastov, et al., 1981 | ALS |
ΔvapH° | 29.6 ± 0.3 | kJ/mol | N/A | Papina, Erastov, et al., 1981 | AC |
ΔvapH° | 29.6 ± 0.1 | kJ/mol | C | Majer, Svoboda, et al., 1980 | AC |
Enthalpy of vaporization
ΔvapH (kJ/mol) | Temperature (K) | Method | Reference | Comment |
---|---|---|---|---|
28.08 | 323.3 | N/A | Majer and Svoboda, 1985 | |
30.0 | 310. | A | Stephenson and Malanowski, 1987 | Based on data from 298. to 323. K.; AC |
33.2 | 237. | A | Stephenson and Malanowski, 1987 | Based on data from 222. to 329. K. See also Bottomley and Seiflow, 2007 and Dykyj, 1970.; AC |
28.7 ± 0.1 | 313. | C | Majer, Svoboda, et al., 1980 | AC |
27.8 ± 0.1 | 328. | C | Majer, Svoboda, et al., 1980 | AC |
26.8 ± 0.1 | 343. | C | Majer, Svoboda, et al., 1980 | AC |
34.3 | 242. | N/A | Kudryashov and Savechenko, 1965 | Based on data from 227. to 318. K.; AC |
Enthalpy of vaporization
ΔvapH =
A exp(-βTr) (1 − Tr)β
ΔvapH =
Enthalpy of vaporization (at saturation pressure)
(kJ/mol)
Tr = reduced temperature (T / Tc)
View plot Requires a JavaScript / HTML 5 canvas capable browser.
Temperature (K) | A (kJ/mol) | β | Tc (K) | Reference | Comment |
---|---|---|---|---|---|
298. to 328. | 45.72 | 0.286 | 496.3 | Majer and Svoboda, 1985 |
Antoine Equation Parameters
log10(P) = A − (B / (T + C))
P = vapor pressure (bar)
T = temperature (K)
View plot Requires a JavaScript / HTML 5 canvas capable browser.
Temperature (K) | A | B | C | Reference | Comment |
---|---|---|---|---|---|
222.5 to 328.50 | 3.82525 | 1016.075 | -57.581 | Bottomley and Seiflow, 1963 | Coefficents calculated by NIST from author's data. |
Enthalpy of fusion
ΔfusH (kJ/mol) | Temperature (K) | Reference | Comment |
---|---|---|---|
4.840 | 157.4 | Golovanova and Kolesov, 1984, 2 | DH |
4.84 | 154.7 | Domalski and Hearing, 1996 | AC |
Entropy of fusion
ΔfusS (J/mol*K) | Temperature (K) | Reference | Comment |
---|---|---|---|
30.7 | 157.4 | Golovanova and Kolesov, 1984, 2 | DH |

Gas phase ion energetics data

Data compiled by: Sharon G. Lias, Rhoda D. Levin, and Sherif A. Kafafi
Ionization energy determinations
IE (eV) | Method | Reference | Comment |
---|---|---|---|
11.0 | PE | Dumas, Dupuis, et al., 1981 | |
11.2 | PE | Dumas, Dupuis, et al., 1981 | Vertical value |

Normal alkane RI, non-polar column, temperature ramp

Column type | Active phase | I | Reference | Comment |
---|---|---|---|---|
Capillary | BP-1 | 541. | Health Safety Executive, 2000 | 50. m/0.22 mm/0.75 μm, He, 5. K/min; Tstart: 50. C; Tend: 200. C |

Normal alkane RI, non-polar column, custom temperature program

Column type | Active phase | I | Reference | Comment |
---|---|---|---|---|
Capillary | SPB-1 | 543. | Flanagan, Streete, et al., 1997 | 60. m/0.53 mm/5. μm, He; Program: 40C(6min) => 5C/min => 80C => 10C/min => 200C |
Capillary | SPB-1 | 543. | Strete, Ruprah, et al., 1992 | 60. m/0.53 mm/5.0 μm, Helium; Program: 40 0C (6 min) 5 0C/min -> 80 0C 10 0C/min -> 200 0C |
Capillary | SPB-1 | 533. | Strete, Ruprah, et al., 1992 | 60. m/0.53 mm/5.0 μm, Helium; Program: not specified |
Capillary | CP Sil 8 CB | 555. | Weller and Wolf, 1989 | 40. m/0.25 mm/0.25 μm, He; Program: 30 0C (1 min) 15 0C/min -> 45 0C 3 0C/min -> 120 0C |
Capillary | OV-1 | 533. | Ramsey and Flanagan, 1982 | Program: not specified |

Normal alkane RI, polar column, custom temperature program

Column type | Active phase | I | Reference | Comment |
---|---|---|---|---|
Capillary | Carbowax 20M | 858. | Ramsey and Flanagan, 1982 | Program: not specified |

References

Papina, Erastov, et al., 1981
Papina, T.S.; Erastov, P.A.; Kolesov, V.P.,
The enthalpies of formation of 1,1,1-trifluoro-2-chloro-2-bromoethane and 1,1,2-trifluoro-2-chloro-1-bromoethane,
J. Chem. Thermodyn., 1981, 13, 683-689. [all data]
Kolesov and Papina, 1983
Kolesov, V.P.; Papina, T.S.,
Thermochemistry of Haloethanes,
Russ. Chem. Rev., 1983, 52, 425. [all data]
Vesely, Zabransky, et al., 1988
Vesely, F.; Zabransky, M.; Barcal, P.; Svoboda, V.,
Molar heat capacities of four liquid fluorinated and halogenated ethanes,
J. Chem. Thermodynam., 1988, 20, 1283-1285. [all data]
Aldrich Chemical Company Inc., 1990
Aldrich Chemical Company Inc.,
Catalog Handbook of Fine Chemicals, Aldrich Chemical Company, Inc., Milwaukee WI, 1990, 1. [all data]
Francesconi, Comelli, et al., 1990
Francesconi, R.; Comelli, F.; Giacomo, D.,
Excess Enthalpy for the Binary System 1,3-Dioxolane + Halothane,
J. Chem. Eng. Data, 1990, 35, 190. [all data]
PCR Inc., 1990
PCR Inc.,
Research Chemicals Catalog 1990-1991, PCR Inc., Gainesville, FL, 1990, 1. [all data]
Majer and Svoboda, 1985
Majer, V.; Svoboda, V.,
Enthalpies of Vaporization of Organic Compounds: A Critical Review and Data Compilation, Blackwell Scientific Publications, Oxford, 1985, 300. [all data]
Pashchenko and Varushchenko, 1985
Pashchenko, L.L.; Varushchenko, R.M.,
Zh. Obshch. Khim., 1985, 55, 721. [all data]
Golovanova and Kolesov, 1984
Golovanova, Y.G.; Kolesov, V.P.,
Enthalpies of melting, melting temperatures, and cryoscopic constants of some haloorganic compounds,
Vestn. Mosk. Univ., Ser. 2: Khim., 1984, 25, 244. [all data]
Varushchenko, Druzhinina, et al., 2007
Varushchenko, R.M.; Druzhinina, A.I.; Kuramshina, G.M.; Dorofeeva, O.V.,
Thermodynamics of vaporization of some freons and halogenated ethanes and propanes,
Fluid Phase Equilibria, 2007, 256, 1-2, 112-122, https://doi.org/10.1016/j.fluid.2007.02.017
. [all data]
Majer, Svoboda, et al., 1980
Majer, Vladimír; Svoboda, Václav; Posta, Antonín; Pick, Jirí,
Determination of heats of vaporization and some other thermodynamic quantities for several fluorinated halogen derivatives of ethane and propane,
Collect. Czech. Chem. Commun., 1980, 45, 11, 3063-3068, https://doi.org/10.1135/cccc19803063
. [all data]
Stephenson and Malanowski, 1987
Stephenson, Richard M.; Malanowski, Stanislaw,
Handbook of the Thermodynamics of Organic Compounds, 1987, https://doi.org/10.1007/978-94-009-3173-2
. [all data]
Bottomley and Seiflow, 2007
Bottomley, G.A.; Seiflow, G.H.P.,
Vapour pressure and vapour density of halothane (2-bromo-2-chloro-1,1,1-trifluoroethane),
J. Appl. Chem., 2007, 13, 9, 399-402, https://doi.org/10.1002/jctb.5010130905
. [all data]
Dykyj, 1970
Dykyj, J.,
Petrochemica, 1970, 10, 2, 51. [all data]
Kudryashov and Savechenko, 1965
Kudryashov, I.V.; Savechenko, R.I.,
Izv. Vyssh. Uchebn. Zaved., Khim. Khim. Tekhnol., 1965, 8, 602. [all data]
Bottomley and Seiflow, 1963
Bottomley, G.A.; Seiflow, G.H.F.,
Vapour Pressure and Vapour Density of Halothane (2-Bromo-2-Chloro-1,1,1-Trifluoroethane),
J. Appl. Chem., 1963, 13, 9, 399-402, https://doi.org/10.1002/jctb.5010130905
. [all data]
Golovanova and Kolesov, 1984, 2
Golovanova, Yu.G.; Kolesov, V.P.,
Enthalpies of melting, melting temperatures, and cryoscopic constants of some haloorganic compounds, Vestn. Mosk Univ.,
Ser. 2: Khim., 1984, 25(3), 244-248. [all data]
Domalski and Hearing, 1996
Domalski, Eugene S.; Hearing, Elizabeth D.,
Heat Capacities and Entropies of Organic Compounds in the Condensed Phase. Volume III,
J. Phys. Chem. Ref. Data, 1996, 25, 1, 1, https://doi.org/10.1063/1.555985
. [all data]
Dumas, Dupuis, et al., 1981
Dumas, J.-M.; Dupuis, P.; Pfister-Guillouzo, G.; Sandorfy, C.,
Ionization potentials and ultraviolet absorption spectra of fluorocarbon anesthetics,
Can. J. Spectrosc., 1981, 26, 102. [all data]
Health Safety Executive, 2000
Health Safety Executive,
MDHS 96 Volatile organic compounds in air - Laboratory method using pumed solid sorbent tubes, solvent desorption and gas chromatography
in Methods for the Determination of Hazardous Substances (MDHS) guidance, Crown, Colegate, Norwich, 2000, 1-24, retrieved from http://www.hse.gov.uk/pubns/mdhs/pdfs/mdhs96.pdf. [all data]
Flanagan, Streete, et al., 1997
Flanagan, R.J.; Streete, P.J.; Ramsey, J.D.,
Volatile Substance Abuse, UNODC Technical Series, No 5, United Nations, Office on Drugs and Crime, Vienna International Centre, PO Box 500, A-1400 Vienna, Austria, 1997, 56, retrieved from http://www.odccp.org/pdf/technicalseries1997-01-011.pdf. [all data]
Strete, Ruprah, et al., 1992
Strete, P.J.; Ruprah, M.; Ramsey, J.D.; Flanagan, R.J.,
Detection and identification of volatile substances by headspace capillary gas chromatography to aid the diagnosis of acute poisoning,
Analyst, 1992, 117, 7, 1111-1127, https://doi.org/10.1039/an9921701111
. [all data]
Weller and Wolf, 1989
Weller, J.-P.; Wolf, M.,
Massenspektroskopie und Headspace-GC,
Beitr. Gerichtl. Med., 1989, 47, 525-532. [all data]
Ramsey and Flanagan, 1982
Ramsey, J.D.; Flanagan, R.J.,
Detection and Identification of Volatile Organic Compounds in Blood by Headspace Gas Chromatography as an Aid to the Diagnosis of Solvent Abuse,
J. Chromatogr., 1982, 240, 2, 423-444, https://doi.org/10.1016/S0021-9673(00)99622-5
. [all data]