Perfluoro-2-butene, (Z)-
- Formula: C4F8
- Molecular weight: 200.0300
- IUPAC Standard InChIKey: WSJULBMCKQTTIG-UPHRSURJSA-N
- CAS Registry Number: 1516-65-0
- Chemical structure:
View 3d structure (requires JavaScript / HTML 5) - Stereoisomers:

Reaction thermochemistry data

Data compiled by: Hussein Y. Afeefy, Joel F. Liebman, and Stephen E. Stein
Individual Reactions
C4F8 =
By formula: C4F8 = C4F8
Quantity | Value | Units | Method | Reference | Comment |
---|---|---|---|---|---|
ΔrH° | 3.42 ± 0.18 | kJ/mol | Eqk | Schlag and Kaiser, 1965 | gas phase |

Gas phase ion energetics data

Data compiled by: Sharon G. Lias, Rhoda D. Levin, and Sherif A. Kafafi
Ionization energy determinations
IE (eV) | Method | Reference | Comment |
---|---|---|---|
11.46 | PE | Robin, Taylor, et al., 1973 | Vertical value |

References

Schlag and Kaiser, 1965
Schlag, E.W.; Kaiser, E.W., Jr.,
The thermal trans-cis isomerization of octafluorobutene-2,
J. Am. Chem. Soc., 1965, 87, 1171-1174. [all data]
Robin, Taylor, et al., 1973
Robin, M.B.; Taylor, G.N.; Kuebler, N.A.; Bach, R.D.,
Planarity of the carbon skeleton in various alkylated olefins,
J. Org. Chem., 1973, 38, 1049. [all data]