Anisole, p-nitroso-
- Formula: C7H7NO2
- Molecular weight: 137.1360
- IUPAC Standard InChIKey: RIOSDPIZGIWNMS-UHFFFAOYSA-N
- CAS Registry Number: 1516-21-8
- Chemical structure:
View 3d structure (requires JavaScript / HTML 5) - Permanent link for this species. Use this link for bookmarking this species for future reference.

Gas phase ion energetics data

Data compiled by: Sharon G. Lias, Rhoda D. Levin, and Sherif A. Kafafi
Ionization energy determinations
IE (eV) | Method | Reference | Comment |
---|---|---|---|
9.50 | PE | Palmer, Moyes, et al., 1979 | Vertical value |
8.5 ± 0.1 | PE | Egdell, Green, et al., 1975 | Vertical value |

References

Palmer, Moyes, et al., 1979
Palmer, M.H.; Moyes, W.; Spiers, M.; Ridyard, J.N.A.,
The electronic structure of substituted benzenes; ab initio calculations and photoelectron spectra for nitrobenzene, the nitrotoluenes, dinitrobenzenes and fluoronitrobenzenes,
J. Mol. Struct., 1979, 55, 243. [all data]
Egdell, Green, et al., 1975
Egdell, R.; Green, J.C.; Rao, C.N.R.; Gowenlock, B.G.; Pfab, J.,
He(I) photoelectron studies of C-nitroso compounds,
J. Chem. Soc. Faraday Trans. 2, 1975, 988. [all data]
Ramart-Lucas and Martynoff, 1949
Ramart-Lucas, P.; Martynoff, M.,
Bull. soc. chim. France, 1949, [5] 16, 53. [all data]