Benzene, 1-ethyl-4-methoxy-
- Formula: C9H12O
- Molecular weight: 136.1910
- IUPAC Standard InChIKey: HDNRAPAFJLXKBV-UHFFFAOYSA-N
- CAS Registry Number: 1515-95-3
- Chemical structure:
View 3d structure (requires JavaScript / HTML 5) - Other names: Anisole, p-ethyl-; p-Ethylanisole; 1-Ethyl-4-methoxybenzene; 4-Ethylanisole; 1-Methoxy-4-ethyl-benzene; p-Ethylanisol

Phase change data

Data compiled as indicated in comments:
BS - Robert L. Brown and Stephen E. Stein
TRC - Thermodynamics Research Center, NIST Boulder Laboratories, Chris Muzny director
AC - William E. Acree, Jr., James S. Chickos
Quantity | Value | Units | Method | Reference | Comment |
---|---|---|---|---|---|
Tboil | 468.7 | K | N/A | Weast and Grasselli, 1989 | BS |
Tboil | 467. | K | N/A | Wender, Greenfield, et al., 1951 | Uncertainty assigned by TRC = 3. K; TRC |
Tboil | 473. | K | N/A | Gilman and Hoyle, 1922 | Uncertainty assigned by TRC = 4. K; TRC |
Reduced pressure boiling point
Tboil (K) | Pressure (bar) | Reference | Comment |
---|---|---|---|
356.7 | 0.021 | Weast and Grasselli, 1989 | BS |
Enthalpy of vaporization
ΔvapH (kJ/mol) | Temperature (K) | Method | Reference | Comment |
---|---|---|---|---|
51.9 | 321. | A | Stephenson and Malanowski, 1987 | Based on data from 306. to 470. K. See also Stull, 1947.; AC |
Antoine Equation Parameters
log10(P) = A − (B / (T + C))
P = vapor pressure (bar)
T = temperature (K)
View plot Requires a JavaScript / HTML 5 canvas capable browser.
Temperature (K) | A | B | C | Reference | Comment |
---|---|---|---|---|---|
306.7 to 469.7 | 4.70046 | 2011.974 | -41.003 | Stull, 1947 | Coefficents calculated by NIST from author's data. |

Gas phase ion energetics data

Data compiled by: Henry M. Rosenstock, Keith Draxl, Bruce W. Steiner, and John T. Herron
Appearance energy determinations
Ion | AE (eV) | Other Products | Method | Reference | Comment |
---|---|---|---|---|---|
C8H9O+ | 10.8 ± 0.1 | CH3 | EI | Meyer and Harrison, 1964 |

Kovats' RI, non-polar column, isothermal

Column type | Active phase | Temperature (C) | I | Reference | Comment |
---|---|---|---|---|---|
Packed | Apiezon L | 100. | 1110. | Bogoslovsky, Anvaer, et al., 1978 | Chromatone N AW DNCS |
Packed | Apiezon L | 150. | 1124. | Bogoslovsky, Anvaer, et al., 1978 | Chromatone N AW DNCS |

Kovats' RI, polar column, isothermal

Column type | Active phase | Temperature (C) | I | Reference | Comment |
---|---|---|---|---|---|
Packed | PEG-20M | 160. | 1550.8 | Still and Whitehead, 1977 | N2, Chromosorb G; Column length: 3. m |
Packed | PEG-20M | 160. | 1551.2 | Still and Whitehead, 1977 | N2, Chromosorb G; Column length: 3. m |

Normal alkane RI, non-polar column, temperature ramp

Column type | Active phase | I | Reference | Comment |
---|---|---|---|---|
Capillary | HP-5 | 1122. | Larsen and Frisvad, 1995 | 35. C @ 2. min, 6. K/min; Tend: 200. C |
Capillary | Ultra-1 | 1091. | Okumura, 1991 | 25. m/0.32 mm/0.25 μm, He, 3. K/min; Tstart: 80. C; Tend: 260. C |

Normal alkane RI, non-polar column, custom temperature program

Column type | Active phase | I | Reference | Comment |
---|---|---|---|---|
Capillary | HP-5 | 1104. | Splivallo, Bossi, et al., 2007 | He; Program: 50C => 3C/min => 200C(10min) => 10C/min => 290C(10min) |

References

Weast and Grasselli, 1989
CRC Handbook of Data on Organic Compounds, 2nd Editon, Weast,R.C and Grasselli, J.G., ed(s)., CRC Press, Inc., Boca Raton, FL, 1989, 1. [all data]
Wender, Greenfield, et al., 1951
Wender, I.; Greenfield, H.; Orchin, M.,
Chemistry of Oxo and Related Reactions IV. Reductions in the Aromatic Series,
J. Am. Chem. Soc., 1951, 73, 2656. [all data]
Gilman and Hoyle, 1922
Gilman, H.; Hoyle, R.E.,
A New Method for the Introduction of An Ethyl Group. The Reaction Between Organomagnesium Halides and Diethyl SUlfate,
J. Am. Chem. Soc., 1922, 44, 2621. [all data]
Stephenson and Malanowski, 1987
Stephenson, Richard M.; Malanowski, Stanislaw,
Handbook of the Thermodynamics of Organic Compounds, 1987, https://doi.org/10.1007/978-94-009-3173-2
. [all data]
Stull, 1947
Stull, Daniel R.,
Vapor Pressure of Pure Substances. Organic and Inorganic Compounds,
Ind. Eng. Chem., 1947, 39, 4, 517-540, https://doi.org/10.1021/ie50448a022
. [all data]
Meyer and Harrison, 1964
Meyer, F.; Harrison, A.G.,
An electron impact study of methyl phenyl ethers,
Can. J. Chem., 1964, 42, 2008. [all data]
Bogoslovsky, Anvaer, et al., 1978
Bogoslovsky, Yu.N.; Anvaer, B.I.; Vigdergauz, M.S.,
Chromatographic constants in gas chromatography (in Russian), Standards Publ. House, Moscow, 1978, 192. [all data]
Still and Whitehead, 1977
Still, R.H.; Whitehead, A.,
Thermal degradation of polymers. XV. Vacuum pyrolysis studies on poly(p-methoxystyrene) and poly(p-hydroxystyrene),
J. Appl. Polym. Sci., 1977, 21, 5, 1199-1213, https://doi.org/10.1002/app.1977.070210504
. [all data]
Larsen and Frisvad, 1995
Larsen, T.O.; Frisvad, J.C.,
Characterization of volatile metabolites from 47 Penicillium taxa,
Mycol. Res., 1995, 99, 10, 1153-1166, https://doi.org/10.1016/S0953-7562(09)80271-2
. [all data]
Okumura, 1991
Okumura, T.,
retention indices of environmental chemicals on methyl silicone capillary column,
Journal of Environmental Chemistry (Japan), 1991, 1, 2, 333-358, https://doi.org/10.5985/jec.1.333
. [all data]
Splivallo, Bossi, et al., 2007
Splivallo, R.; Bossi, S.; Maffei, M.; Bonfante, P.,
Discrimination of truffle fruiting body versus mycelial aromas by stir bar sorptive extraction,
Phytochemistry, 2007, 68, 20, 2584-2598, https://doi.org/10.1016/j.phytochem.2007.03.030
. [all data]