Benzene, 1,3-butadienyl-
- Formula: C10H10
- Molecular weight: 130.1864
- IUPAC Standard InChIKey: XZKRXPZXQLARHH-UHFFFAOYSA-N
- CAS Registry Number: 1515-78-2
- Chemical structure:
View 3d structure (requires JavaScript / HTML 5) - Stereoisomers:
- Other names: 1,3-Butadiene, 1-phenyl-; 1-Phenylbutadiene; 1-Phenyl-1,3-butadiene; 1,3-Butadienylbenzene

Gas phase ion energetics data

Data compiled by: Sharon G. Lias, Rhoda D. Levin, and Sherif A. Kafafi
Ionization energy determinations
IE (eV) | Method | Reference |
---|---|---|
8.39 | PE | Rucker, Lang, et al., 1980 |

Van Den Dool and Kratz RI, polar column, temperature ramp

Column type | Active phase | I | Reference | Comment |
---|---|---|---|---|
Capillary | DB-Wax | 1572. | Shimoda, Shigematsu, et al., 1995 | 60. m/0.25 mm/0.25 μm, 2. K/min; Tstart: 50. C; Tend: 230. C |

Normal alkane RI, non-polar column, temperature ramp

Column type | Active phase | I | Reference | Comment |
---|---|---|---|---|
Capillary | DB-5 | 1150. | Mevy, Bessiere, et al., 2004 | 30. m/0.25 mm/0.15 μm, 60. C @ 3. min, 3. K/min; Tend: 220. C |

Lee's RI, non-polar column, custom temperature program

Column type | Active phase | I | Reference | Comment |
---|---|---|---|---|
Capillary | DB-5 | 177. | Fuentes, Font, et al., 2007 | Column length: 60. m; Program: not specified |

References

Rucker, Lang, et al., 1980
Rucker, C.; Lang, D.; Sauer, J.; Friege, H.; Sustmann, R.,
Reaktivitat substituierter 1,3-Butadiene in Diels-Alder-Reaktionen,
Chem. Ber., 1980, 113, 1663. [all data]
Shimoda, Shigematsu, et al., 1995
Shimoda, M.; Shigematsu, H.; Shiratsuchi, H.; Osajima, Y.,
Comparison of the odor concentrates by SDE and adsorptive column method from green tea infusion,
J. Agric. Food Chem., 1995, 43, 6, 1616-1620, https://doi.org/10.1021/jf00054a037
. [all data]
Mevy, Bessiere, et al., 2004
Mevy, J.P.; Bessiere, J.M.; Pelissier, Y.; Masotti, V.; Ruzzier, M.; Rabier, J.; Viano, J.,
Composition of the volatile constituents of the aerial parts of an endemic plant of Ivory Coast, Monanthotaxis capea (E.G. A. Camus) Verdc,
Flavour Fragr. J., 2004, 19, 6, 526-528, https://doi.org/10.1002/ffj.1329
. [all data]
Fuentes, Font, et al., 2007
Fuentes, M.J.; Font, R.; Gomez-Rico, M.F.; Martin-Gullon, I.,
Pyrolysis and combustion of waste lubricant oil from diesel cars: Decomposition and pollutants,
J. Anal. Appl. Pyrolysis, 2007, 79, 1-2, 215-226, https://doi.org/10.1016/j.jaap.2006.12.004
. [all data]