Imidosulfurous difluoride, (trifluoromethyl)-
- Formula: CF5NS
- Molecular weight: 153.074
- IUPAC Standard InChIKey: VVZLBKDAOLLASD-UHFFFAOYSA-N
- CAS Registry Number: 1512-14-7
- Chemical structure:
View 3d structure (requires JavaScript / HTML 5) - Other names: N-Trifluoromethylimidosulfurous difluoride

Gas phase ion energetics data

Data compiled by: Henry M. Rosenstock, Keith Draxl, Bruce W. Steiner, and John T. Herron
Appearance energy determinations
Ion | AE (eV) | Other Products | Method | Reference | Comment |
---|---|---|---|---|---|
CF3+ | 14.23 ± 0.05 | ? | EI | Glemser, Muller, et al., 1968 | |
NSF2+ | 13.90 ± 0.08 | CF3 | EI | Glemser, Muller, et al., 1968 | |
SF2+ | 13.0 ± 0.1 | ? | EI | Glemser, Muller, et al., 1968 |

References

Glemser, Muller, et al., 1968
Glemser, O.; Muller, A.; Bohler, D.; Krebs, B.,
Die N-S-Bindung: Bindungslangen Kraftkonstanten, Bindungsgrade und Bindungsenergien,
Z. Anorg. Allgem. Chem., 1968, 357, 184. [all data]